{"text_format":"1","workbook":"xlsx","n_sheets":6,"sheets":["Muni","Summary","Self Liquidating","Local School","Regional School","Spec Borrowing Power"],"not_rendered":{"charts":0,"images":2,"macros":1,"external_links":0,"defined_names":9,"comments":0,"pivot_tables":0},"unopened":[],"bounds":{"document_bytes":16777216,"sheet_cells":100000,"rows_first":2000,"rows_last":500,"rows_between":2000,"halvings":0,"cell_chars":16384,"cell_head_chars":4096},"cells_cut":0,"cells_raw":0,"read":"whole","date_system":"1900"}

{"sheet":"Muni","index":0,"n_rows":586,"n_cols":13,"rows_kept":586,"cut":false,"hidden":true,"merged":[[0,9,0,19]]}
["ENTITY NAME","CODE","COUNTY",2022,2023,2024,"3-YEAR AVERAGE","SCHOOL ","UTILITY"]
["Aberdeen Township","1330","Monmouth",2850322221,3125890785,3454220882,{"$f":"AVERAGE(D2:F2)","v":3143477962.6666665}]
["Absecon City","0101","Atlantic",857513986,948766396,1059538473,{"$f":"AVERAGE(D3:F3)","v":955272951.66666663},null,null,null,0,null,"Black Horse Pike Regional School District"]
["Alexandria Township","1001","Hunterdon",886478833,963637307,1023378027,957831389,"Type I","Arena",null,2.5000000000000001E-2,null,"Bordentown Regional School District"]
["Allamuchy Township","2101","Warren",844022228,908686619,1004087945,918932264,"Type II","Affordable Housing",null,0.03,null,"Bridgewater-Raritan Regional School District"]
["Allendale Borough","0201","Bergen",2075748594,2210697687,2448582994,2245009758.3333335,null,"Airport",null,3.5000000000000003E-2,null,"Buena Regional School District"]
["Allenhurst Borough","1301","Monmouth",976186662,1461222836,1462314264,1299907920.6666667,null,"Beach",null,0.04,null,"Caldwell-West Caldwell Consolidated School District"]
["Allentown Borough","1302","Monmouth",199377689,247591026,290113947,245694220.66666666,null,"Electric",null,null,null,"Carlstadt-East Rutherford Regional High School"]
["Alloway Township","1701","Salem",331411333,389360960,406222772,375665021.66666669,null,"Golf Course",null,null,null,"Central Regional School District"]
["Alpha Borough","2102","Warren",242982939,275308421,315051334,277780898,null,"Harbor",null,null,null,"Chatham School District"]
["Alpine Borough","0202","Bergen",1880436604,2083185419,2091566133,2018396052,null,"Ice Rink",null,null,null,"Chester Township Consolidated School District"]
["Andover Borough","1901","Sussex",83005193,83403009,94112207,86840136.333333328,null,"Marina",null,null,null,"Clearview Regional School District"]
["Andover Township","1902","Sussex",869957194,918694059,1022235610,936962287.66666663,null,"Parking ",null,null,null,"Clinton-Glen Gardner School District"]
["Asbury Park City","1303","Monmouth",2483123847,2800143553,3212152473,2831806624.3333335,null,"Recreation",null,null,null,"Cumberland Regional High School"]
["Atlantic City","0102","Atlantic",3186835403,3448065018,3702839432,3445913284.3333335,null,"Sewer",null,null,null,"Delaware Valley Regional High School"]
{"$rows_left_out":572}
{"sheet":"Summary","index":1,"n_rows":48,"n_cols":29,"rows_kept":48,"cut":false,"hidden":false,"merged":[[23,9,23,17],[25,9,25,10],[12,9,12,19],[27,9,27,10],[26,9,26,10],[18,9,18,11],[38,11,38,17],[40,9,40,17],[29,11,29,13],[29,9,29,10],[45,10,45,19],[30,11,30,13],[31,11,31,13],[31,9,31,10],[30,9,30,10],[47,10,47,19],[7,11,7,14],[26,11,26,13],[27,11,27,13],[28,11,28,13],[42,9,42,17],[25,11,25,13],[46,10,46,19],[19,9,19,11],[20,9,20,11],[44,8,44,19],[37,11,37,17],[28,9,28,10],[39,11,39,17],[35,9,35,17],[34,9,34,17],[9,11,9,14],[1,8,1,19],[17,15,17,17],[3,11,3,13],[0,8,0,19],[14,9,14,19],[13,9,13,19],[10,17,10,19],[2,8,2,19],[10,11,10,14],[6,13,6,14],[9,17,9,19],[8,11,8,14],[7,17,7,19],[8,17,8,19],[11,11,11,14]]}
[null,null,null,null,null,null,null,null,"State of New Jersey"]
[{"$f":"MID(CELL(\"filename\",A2),FIND(\"]\",CELL(\"filename\",A2))+1,256)","v":"Summary"},{"$f":"ROW()","v":2},{"$f":"+J4","v":"Local Unit:"},{"$f":"R7","v":0},"sds",null," ",{"$f":"T4","v":"COUNTY"},"Department of Community Affairs"]
["Summary",{"$f":"ROW()","v":3},{"$f":"+J4","v":"Local Unit:"},{"$f":"R7","v":0},"sds",null," ",{"$f":"T4","v":"COUNTY"},"Supplemental Debt Statement"]
["Summary",{"$f":"ROW()","v":4},{"$f":"+J4","v":"Local Unit:"},{"$f":"R7","v":0},"sds","muni","code",{"$f":"T4","v":"COUNTY"},null,"Local Unit:",null,"ENTITY NAME",null,null,null,{"$f":"VLOOKUP(L4,Muni!A1:C586,2,FALSE)","v":"CODE"},null,"County:",null,{"$f":"VLOOKUP(L4,Muni!A1:C586,3,FALSE)","v":"COUNTY"}]
[null,null,null,null,null,null,null,null,null,null,null,null,null,null,null,null,null," Prepared as of:"]
["Summary",{"$f":"ROW()","v":6},{"$f":"+J4","v":"Local Unit:"},{"$f":"R7","v":0},"sds"," "," "]
["Summary",{"$f":"ROW()","v":7},{"$f":"+J4","v":"Local Unit:"},{"$f":"R7","v":0},"sds","bond","ord",{"$f":"T4","v":"COUNTY"},null,null,null,null,"Budget Year Ending:","December 31",null,2025]
["Summary",{"$f":"ROW()","v":8},{"$f":"+J4","v":"Local Unit:"},{"$f":"R7","v":0},"sds","cfo","name",{"$f":"T4","v":"COUNTY"},null,null,"Name:",null,null,null,null,"Phone:",null,null,null,null,null,null,null,null,null,null,null,null,"June 30"]
["Summary",{"$f":"ROW()","v":9},{"$f":"+J4","v":"Local Unit:"},{"$f":"R7","v":0},"sds","cfo","title",{"$f":"T4","v":"COUNTY"},null,null,"Title:",null,null,null,null,"Email:",null,null,null,null,null,null,null,null,null,null,null,null,"December 31"]
[{"$f":"MID(CELL(\"filename\",A10),FIND(\"]\",CELL(\"filename\",A10))+1,256)","v":"Summary"},{"$f":"ROW()","v":10},{"$f":"+J4","v":"Local Unit:"},{"$f":"R7","v":0},"sds","cfo","add1",{"$f":"T4","v":"COUNTY"},null,null,"CFO Cert. #",null,null,null,null,"Address:"]
[{"$f":"MID(CELL(\"filename\",A11),FIND(\"]\",CELL(\"filename\",A11))+1,256)","v":"Summary"},{"$f":"ROW()","v":11},{"$f":"+J4","v":"Local Unit:"},{"$f":"R7","v":0},"sds","cfo","add2",{"$f":"T4","v":"COUNTY"}]
[{"$f":"MID(CELL(\"filename\",A12),FIND(\"]\",CELL(\"filename\",A12))+1,256)","v":"Summary"},{"$f":"ROW()","v":12},{"$f":"+J4","v":"Local Unit:"},{"$f":"R7","v":0},"sds","cfo","add3",{"$f":"T4","v":"COUNTY"}]
[{"$f":"MID(CELL(\"filename\",A13),FIND(\"]\",CELL(\"filename\",A13))+1,256)","v":"Summary"},{"$f":"ROW()","v":13},{"$f":"+J4","v":"Local Unit:"},{"$f":"R7","v":0},"sds",null,null,{"$f":"T4","v":"COUNTY"},null,{"$f":"\"\"&L8&\", Being duly sworn, deposes and says:\"","v":", Being duly sworn, deposes and says:"}]
[null,null,null,null,null,null,null,null,null,{"$f":"\"Deponent is the Chief  Officer of \"&L4&\" here and in the statement hereinafter mentioned called the local unit.\"","v":"Deponent is the Chief  Officer of ENTITY NAME here and in the statement hereinafter mentioned called the local unit."}]
[null,null,null,null,null,null,null,null,null,"The Supplemental Debt Statement annexed hereto and hereby made a part hereof is a true statement of the debt condition of the local unit as of the date therein and is computed as provided by the Local Bond Law of New Jersey."]
{"$rows_left_out":34}
{"sheet":"Self Liquidating","index":2,"n_rows":15,"n_cols":16,"rows_kept":15,"cut":false,"hidden":false,"merged":[[0,8,0,15],[1,8,1,15],[13,9,13,10],[5,9,5,10],[6,9,6,10],[7,9,7,10],[8,9,8,10]]}
[{"$f":"MID(CELL(\"filename\",A1),FIND(\"]\",CELL(\"filename\",A1))+1,256)","v":"Self Liquidating"},{"$f":"ROW()","v":1},{"$f":"Summary!J4","v":"Local Unit:"},{"$f":"Summary!R7","v":0},"sds"," "," ",{"$f":"Summary!T4","v":"COUNTY"},"COMPUTATION AS TO INDEBTEDNESS FOR IMPROVEMENT OR EXTENSION OF AN"]
[{"$f":"MID(CELL(\"filename\",A2),FIND(\"]\",CELL(\"filename\",A2))+1,256)","v":"Self Liquidating"},{"$f":"ROW()","v":2},{"$f":"Summary!J4","v":"Local Unit:"},{"$f":"Summary!R7","v":0},"sds"," "," ",{"$f":"Summary!T4","v":"COUNTY"},"EXISTING MUNICIPAL PUBLIC UTILITY, NJSA 40A:2-7(h); NJSA 40A:2-47(a)"]
[]
[{"$f":"MID(CELL(\"filename\",A4),FIND(\"]\",CELL(\"filename\",A4))+1,256)","v":"Self Liquidating"},{"$f":"ROW()","v":4},{"$f":"Summary!J4","v":"Local Unit:"},{"$f":"Summary!R7","v":0},"sds","mpu","util",{"$f":"Summary!T4","v":"COUNTY"},null,null,"Municipal Public Utility:"]
[]
[{"$f":"MID(CELL(\"filename\",A6),FIND(\"]\",CELL(\"filename\",A6))+1,256)","v":"Self Liquidating"},{"$f":"ROW()","v":6},{"$f":"Summary!J4","v":"Local Unit:"},{"$f":"Summary!R7","v":0},"sds","mpu","xru",{"$f":"Summary!T4","v":"COUNTY"},1,"Annual Debt Statement, excess in revenues of utility",null,null,0,0,0,0]
["Self Liquidating",{"$f":"ROW()","v":7},{"$f":"Summary!J4","v":"Local Unit:"},{"$f":"Summary!R7","v":0},"sds","mpu","lidr",{"$f":"Summary!T4","v":"COUNTY"},2,"Less Interest and principal computed as provided in NJSA 40A:2-47(a) for all obligations authorized but not issued to the extent not already charged to income in the annual debt statement.",null,null,0,0,0,0]
["Self Liquidating",{"$f":"ROW()","v":8},{"$f":"Summary!J4","v":"Local Unit:"},{"$f":"Summary!R7","v":0},"sds","mpu","xrrp",{"$f":"Summary!T4","v":"COUNTY"},3,"Excess revenue prior to authorizing proposed obligations = (line 1 minus line 2)",null,{"$f":"+L6-L7","v":0},{"$f":"+M6-M7","v":0},{"$f":"+N6-N7","v":0},{"$f":"+O6-O7","v":0},{"$f":"+P6-P7","v":0}]
["Self Liquidating",{"$f":"ROW()","v":9},{"$f":"Summary!J4","v":"Local Unit:"},{"$f":"Summary!R7","v":0},"sds","mpu","idrc",{"$f":"Summary!T4","v":"COUNTY"},4,"Interest and principal calculated for proposed obligations NJSA 40A:2-47(a)"]
["Self Liquidating",{"$f":"ROW()","v":10},{"$f":"Summary!J4","v":"Local Unit:"},{"$f":"Summary!R7","v":0},"sds","mpu","i1y",{"$f":"Summary!T4","v":"COUNTY"},null,"(a) Interest for one year at 4 1/2% ",null,null,0,0,0,0]
["Self Liquidating",{"$f":"ROW()","v":11},{"$f":"Summary!J4","v":"Local Unit:"},{"$f":"Summary!R7","v":0},"sds","mpu","fisb",{"$f":"Summary!T4","v":"COUNTY"},null,"(b) First installment of serial bonds legally issuable",null,null,0,0,0,0]
["Self Liquidating",{"$f":"ROW()","v":12},{"$f":"Summary!J4","v":"Local Unit:"},{"$f":"Summary!R7","v":0},"sds","mpu","tcab",{"$f":"Summary!T4","v":"COUNTY"},null,"(c) Total charges (Items (a) and (b))",null,{"$f":"L10+L11","v":0},{"$f":"M10+M11","v":0},{"$f":"N10+N11","v":0},{"$f":"O10+O11","v":0},{"$f":"P10+P11","v":0}]
[]
["Self Liquidating",{"$f":"ROW()","v":14},{"$f":"Summary!J4","v":"Local Unit:"},{"$f":"Summary!R7","v":0},"sds",null,null,{"$f":"Summary!T4","v":"COUNTY"},null,"Note: If line 3 equals or exceeds line 4, obligations may be authorized under the provisions of NJSA 40A:2-7(h) as limited by NJSA 40A:2-47(a)."]
[{"$f":"MID(CELL(\"filename\",A15),FIND(\"]\",CELL(\"filename\",A15))+1,256)","v":"Self Liquidating"},{"$f":"ROW()","v":15},{"$f":"+Summary!J4","v":"Local Unit:"},{"$f":"Summary!R7","v":0},"sds",null,null,{"$f":"Summary!T4","v":"COUNTY"}]
{"$rows_left_out":1}
{"sheet":"Local School","index":3,"n_rows":29,"n_cols":15,"rows_kept":29,"cut":false,"hidden":false,"merged":[[0,8,0,14],[12,9,12,12],[21,9,21,12]]}
[{"$f":"MID(CELL(\"filename\",A1),FIND(\"]\",CELL(\"filename\",A1))+1,256)","v":"Local School"},{"$f":"ROW()","v":1},{"$f":"Summary!J4","v":"Local Unit:"},{"$f":"Summary!R7","v":0},"sds",null,null,{"$f":"Summary!T4","v":"COUNTY"},"COMPUTATION OF SCHOOL INDEBTEDNESS AND DEDUCTIONS UNDER PROVISIONS OF NJSA 18A: 24-17"]
["Local School",{"$f":"ROW()","v":2},"0103",{"$f":"Summary!R7","v":0},"sds",null,null,{"$f":"Summary!T4","v":"COUNTY"},null,null,"Check if municipality or county has no local school district. "]
["Local School",{"$f":"ROW()","v":3},"0103",{"$f":"Summary!R7","v":0},"sds",null,null,{"$f":"Summary!T4","v":"COUNTY"},null,"NJSA 18A:24-19 (Lines 1 to 7)"]
["Local School",{"$f":"ROW()","v":4},"0103",{"$f":"Summary!R7","v":0},"sds","sid",null,{"$f":"Summary!T4","v":"COUNTY"},1,"Average of equalized valuations (page 1, line 3) ",null,null,null,null,{"$f":"Summary!T41","v":{"$error":"#DIV/0!"}}]
["Local School",{"$f":"ROW()","v":5},"0103",{"$f":"Summary!R7","v":0},"sds","sid",null,{"$f":"Summary!T4","v":"COUNTY"},2,"Gross School District Debt outstanding and authorized but not issued (not including proposed issue)",null,null,null,null,0]
["Local School",{"$f":"ROW()","v":6},"0103",{"$f":"Summary!R7","v":0},"sds","sid",null,{"$f":"Summary!T4","v":"COUNTY"},3,"Less: Sinking funds held for payment of School Debt, by Sinking Fund Commission ",null,null,null,null,0]
["Local School",{"$f":"ROW()","v":7},"0103",{"$f":"Summary!R7","v":0},"sds","sid",null,{"$f":"Summary!T4","v":"COUNTY"},4,"Net debt for school purposes (line 2, minus line 3) ",null,null,null,null,{"$f":"+O5-O6","v":0}]
["Local School",{"$f":"ROW()","v":8},"0103",{"$f":"Summary!R7","v":0},"sds","sid",null,{"$f":"Summary!T4","v":"COUNTY"},5,"Debt deduction for school purposes’ % (as per line_below) ",null,null,null,0,{"$f":"+N8*O4","v":{"$error":"#DIV/0!"}}]
["Local School",{"$f":"ROW()","v":9},"0103",{"$f":"Summary!R7","v":0},"sds","sid",null,{"$f":"Summary!T4","v":"COUNTY"},null,null,"(a) 2½% Kindergarten or Grade 1 through Grade 6 "]
["Local School",{"$f":"ROW()","v":10},"0103",{"$f":"Summary!R7","v":0},"sds","sid",null,{"$f":"Summary!T4","v":"COUNTY"},null,null,"(b) 3 % Kindergarten or Grade 1 through Grade 8"]
["Local School",{"$f":"ROW()","v":11},"0103",{"$f":"Summary!R7","v":0},"sds","sid",null,{"$f":"Summary!T4","v":"COUNTY"},null,null,"(c) 3½% Kindergarten or Grade 1 through Grade 9 "]
["Local School",{"$f":"ROW()","v":12},"0103",{"$f":"Summary!R7","v":0},"sds","sid",null,{"$f":"Summary!T4","v":"COUNTY"},null,null,"(d) 4 % Kindergarten or Grade 1 through Grade 12 "]
["Local School",{"$f":"ROW()","v":13},"0103",{"$f":"Summary!R7","v":0},"sds","sid",null,{"$f":"Summary!T4","v":"COUNTY"},6,"Available debt deduction (excess, if any, of line 5 over line 4) ",null,null,null,null,{"$f":"+O8-O7","v":{"$error":"#DIV/0!"}}]
["Local School",{"$f":"ROW()","v":14},"0103",{"$f":"Summary!R7","v":0},"sds","sid",null,{"$f":"Summary!T4","v":"COUNTY"},7,"School Bonds about to be authorized ",null,null,null,null,0]
["Local School",{"$f":"ROW()","v":15},"0103",{"$f":"Summary!R7","v":0},"sds","sid",null,{"$f":"Summary!T4","v":"COUNTY"},null,"Note: Omit lines 8 to 13, if line 6 equals or exceeds line 7. or if shown on line 17"]
{"$rows_left_out":15}
{"sheet":"Regional School","index":4,"n_rows":22,"n_cols":14,"rows_kept":22,"cut":false,"hidden":false,"merged":[[3,9,3,10],[3,13,4,13],[3,11,4,11],[3,12,4,12],[0,8,0,13],[3,8,4,8]]}
[{"$f":"MID(CELL(\"filename\",A1),FIND(\"]\",CELL(\"filename\",A1))+1,256)","v":"Regional School"},{"$f":"ROW()","v":1},{"$f":"Summary!J4","v":"Local Unit:"},{"$f":"Summary!R7","v":0},"sds",null,null,{"$f":"Summary!T4","v":"COUNTY"},"Computation of Regional School Indebtedness"]
[null,null,null,null,null,null,null,null,null,"Check if municipality of county has no regional school district. "]
["Regional School",{"$f":"ROW()","v":3},{"$f":"Summary!J4","v":"Local Unit:"},{"$f":"Summary!R7","v":0},"sds",null,null,{"$f":"Summary!T4","v":"COUNTY"},null,1,2,3,4,5]
["Regional School",{"$f":"ROW()","v":4},{"$f":"Summary!J4","v":"Local Unit:"},{"$f":"Summary!R7","v":0},"sds",null,null,{"$f":"Summary!T4","v":"COUNTY"},"Municipality","Average Equalized Valuations           (N.J.S.A. 40A:2-43)",null,"Apportionment of Previous Bonds       Issued or Authorized","Amount Apportionment of Proposed Bond Issue","Total apportionment of previous bonds issued or authorized plus apportionment of proposed bond issue Column 3 plus 4"]
["Regional School",{"$f":"ROW()","v":5},{"$f":"Summary!J4","v":"Local Unit:"},{"$f":"Summary!R7","v":0},"sds",null,null,{"$f":"Summary!T4","v":"COUNTY"},null,"Amount","Percentage"]
["Regional School",{"$f":"ROW()","v":6},{"$f":"Summary!J4","v":"Local Unit:"},{"$f":"Summary!R7","v":0},"sds","regs","debt",{"$f":"Summary!T4","v":"COUNTY"},null,{"$f":"IF(I6=\"\",\"\",VLOOKUP(I6,Muni!A1:G587,7,FALSE))","v":""},{"$f":"IF(J6=\"\",\"\",J6/J$22)","v":""},{"$f":"IF(K6=\"\",\"\",$L$22*K6)","v":""},{"$f":"IF(K6=\"\",\"\",$M$22*K6)","v":""},{"$f":"SUM(L6:M6)","v":0}]
["Regional School",{"$f":"ROW()","v":7},{"$f":"Summary!J4","v":"Local Unit:"},{"$f":"Summary!R7","v":0},"sds","regs","debt",{"$f":"Summary!T4","v":"COUNTY"},null,{"$f":"IF(I7=\"\",\"\",VLOOKUP(I7,Muni!A2:G588,7,FALSE))","v":""},{"$f":"IF(J7=\"\",\"\",J7/J$22)","v":""},{"$f":"IF(K7=\"\",\"\",$L$22*K7)","v":""},{"$f":"IF(K7=\"\",\"\",$M$22*K7)","v":""},{"$f":"SUM(L7:M7)","v":0}]
["Regional School",{"$f":"ROW()","v":8},{"$f":"Summary!J4","v":"Local Unit:"},{"$f":"Summary!R7","v":0},"sds","regs","debt",{"$f":"Summary!T4","v":"COUNTY"},null,{"$f":"IF(I8=\"\",\"\",VLOOKUP(I8,Muni!A3:G589,7,FALSE))","v":""},"",{"$f":"IF(K8=\"\",\"\",$L$22*K8)","v":""},"",0]
["Regional School",{"$f":"ROW()","v":9},{"$f":"Summary!J4","v":"Local Unit:"},{"$f":"Summary!R7","v":0},"sds","regs","debt",{"$f":"Summary!T4","v":"COUNTY"},null,{"$f":"IF(I9=\"\",\"\",VLOOKUP(I9,Muni!A4:G590,7,FALSE))","v":""},"","","",0]
["Regional School",{"$f":"ROW()","v":10},{"$f":"Summary!J4","v":"Local Unit:"},{"$f":"Summary!R7","v":0},"sds","regs","debt",{"$f":"Summary!T4","v":"COUNTY"},null,{"$f":"IF(I10=\"\",\"\",VLOOKUP(I10,Muni!A5:G591,7,FALSE))","v":""},"","","",0]
["Regional School",{"$f":"ROW()","v":11},{"$f":"Summary!J4","v":"Local Unit:"},{"$f":"Summary!R7","v":0},"sds","regs","debt",{"$f":"Summary!T4","v":"COUNTY"},null,{"$f":"IF(I11=\"\",\"\",VLOOKUP(I11,Muni!A6:G592,7,FALSE))","v":""},"","","",0]
["Regional School",{"$f":"ROW()","v":12},{"$f":"Summary!J4","v":"Local Unit:"},{"$f":"Summary!R7","v":0},"sds","regs","debt",{"$f":"Summary!T4","v":"COUNTY"},null,{"$f":"IF(I12=\"\",\"\",VLOOKUP(I12,Muni!A7:G593,7,FALSE))","v":""},"","","",0]
["Regional School",{"$f":"ROW()","v":13},{"$f":"Summary!J4","v":"Local Unit:"},{"$f":"Summary!R7","v":0},"sds","regs","debt",{"$f":"Summary!T4","v":"COUNTY"},null,{"$f":"IF(I13=\"\",\"\",VLOOKUP(I13,Muni!A8:G594,7,FALSE))","v":""},"","","",0]
["Regional School",{"$f":"ROW()","v":14},{"$f":"Summary!J4","v":"Local Unit:"},{"$f":"Summary!R7","v":0},"sds","regs","debt",{"$f":"Summary!T4","v":"COUNTY"},null,{"$f":"IF(I14=\"\",\"\",VLOOKUP(I14,Muni!A9:G595,7,FALSE))","v":""},"","","",0]
["Regional School",{"$f":"ROW()","v":15},{"$f":"Summary!J4","v":"Local Unit:"},{"$f":"Summary!R7","v":0},"sds","regs","debt",{"$f":"Summary!T4","v":"COUNTY"},null,{"$f":"IF(I15=\"\",\"\",VLOOKUP(I15,Muni!A10:G596,7,FALSE))","v":""},"",{"$f":"IF(K15=\"\",\"\",$L$22*K15)","v":""},"",0]
{"$rows_left_out":8}
{"sheet":"Spec Borrowing Power","index":5,"n_rows":25,"n_cols":12,"rows_kept":25,"cut":false,"hidden":false,"merged":[[24,9,24,11],[10,9,10,10],[11,9,11,11],[13,9,13,10],[14,9,14,10],[15,9,15,10],[16,9,16,10],[0,9,0,11],[1,9,1,11],[3,9,3,10],[4,9,4,10],[17,9,17,10]]}
[{"$f":"MID(CELL(\"filename\",#REF!),FIND(\"]\",CELL(\"filename\",#REF!))+1,256)","v":{"$error":"#REF!"}},{"$f":"ROW()","v":1},{"$f":"+Summary!J4","v":"Local Unit:"},{"$f":"Summary!R7","v":0},"sds",null,null,{"$f":"Summary!T4","v":"COUNTY"},null,"SPECIAL DEBT STATEMENT"]
[{"$f":"MID(CELL(\"filename\",#REF!),FIND(\"]\",CELL(\"filename\",#REF!))+1,256)","v":{"$error":"#REF!"}},{"$f":"ROW()","v":2},{"$f":"+Summary!J4","v":"Local Unit:"},{"$f":"Summary!R7","v":0},"sds",null,null,{"$f":"Summary!T4","v":"COUNTY"},null,"BORROWING POWER AVAILABLE UNDER N.J.S.A. 40A:2-7(f)"]
[{"$f":"MID(CELL(\"filename\",#REF!),FIND(\"]\",CELL(\"filename\",#REF!))+1,256)","v":{"$error":"#REF!"}},{"$f":"ROW()","v":3},{"$f":"+Summary!J4","v":"Local Unit:"},{"$f":"Summary!R7","v":0},"sds",null,null,{"$f":"Summary!T4","v":"COUNTY"}]
[{"$f":"MID(CELL(\"filename\",#REF!),FIND(\"]\",CELL(\"filename\",#REF!))+1,256)","v":{"$error":"#REF!"}},{"$f":"ROW()","v":4},{"$f":"+Summary!J4","v":"Local Unit:"},{"$f":"Summary!R7","v":0},"sds","bpa","acdc",{"$f":"Summary!T4","v":"COUNTY"},1,"Amount of accumulated debt incurring capacity under RS 40:1-16(d) as shown on the latest Annual Debt Statement. ",null,0]
[{"$f":"MID(CELL(\"filename\",#REF!),FIND(\"]\",CELL(\"filename\",#REF!))+1,256)","v":{"$error":"#REF!"}},{"$f":"ROW()","v":5},{"$f":"+Summary!J4","v":"Local Unit:"},{"$f":"Summary!R7","v":0},"sds","bpa",null,{"$f":"Summary!T4","v":"COUNTY"},2,"Obligations heretofore authorized in excess of debt limitation and pursuant to:"]
[{"$f":"MID(CELL(\"filename\",#REF!),FIND(\"]\",CELL(\"filename\",#REF!))+1,256)","v":{"$error":"#REF!"}},{"$f":"ROW()","v":6},{"$f":"+Summary!J4","v":"Local Unit:"},{"$f":"Summary!R7","v":0},"sds","bpa","27d",{"$f":"Summary!T4","v":"COUNTY"},null,"(a) NJSA 40A:2-7(d)",0]
[{"$f":"MID(CELL(\"filename\",#REF!),FIND(\"]\",CELL(\"filename\",#REF!))+1,256)","v":{"$error":"#REF!"}},{"$f":"ROW()","v":7},{"$f":"+Summary!J4","v":"Local Unit:"},{"$f":"Summary!R7","v":0},"sds","bpa","27f",{"$f":"Summary!T4","v":"COUNTY"},null,"(b) NJSA 40A:2-7(f) ",0]
[{"$f":"MID(CELL(\"filename\",#REF!),FIND(\"]\",CELL(\"filename\",#REF!))+1,256)","v":{"$error":"#REF!"}},{"$f":"ROW()","v":8},{"$f":"+Summary!J4","v":"Local Unit:"},{"$f":"Summary!R7","v":0},"sds","bpa","27g",{"$f":"Summary!T4","v":"COUNTY"},null,"(c) NJSA 40A:2-7(g)",0]
[{"$f":"MID(CELL(\"filename\",#REF!),FIND(\"]\",CELL(\"filename\",#REF!))+1,256)","v":{"$error":"#REF!"}},{"$f":"ROW()","v":9},{"$f":"+Summary!J4","v":"Local Unit:"},{"$f":"Summary!R7","v":0},"sds","bpa","27t",{"$f":"Summary!T4","v":"COUNTY"},null,"Total ",null,{"$f":"SUM(K6:K8)","v":0}]
[{"$f":"MID(CELL(\"filename\",#REF!),FIND(\"]\",CELL(\"filename\",#REF!))+1,256)","v":{"$error":"#REF!"}},{"$f":"ROW()","v":10},{"$f":"+Summary!J4","v":"Local Unit:"},{"$f":"Summary!R7","v":0},"sds","bpa","adic",{"$f":"Summary!T4","v":"COUNTY"},3,"Available debt incurring capacity (N.J.S.A. 40A:2-7(f)) ",null,0]
[{"$f":"MID(CELL(\"filename\",#REF!),FIND(\"]\",CELL(\"filename\",#REF!))+1,256)","v":{"$error":"#REF!"}},{"$f":"ROW()","v":11},{"$f":"+Summary!J4","v":"Local Unit:"},{"$f":"Summary!R7","v":0},"sds","bpa",null,{"$f":"Summary!T4","v":"COUNTY"},4,"Obligations about to be authorized pursuant toNJSA 40A :2-7(f) (If item 3 equals or exceeds item 4, obligations may be authorized)",null,0]
[{"$f":"MID(CELL(\"filename\",A12),FIND(\"]\",CELL(\"filename\",A12))+1,256)","v":"Spec Borrowing Power"},{"$f":"ROW()","v":12},{"$f":"+Summary!J4","v":"Local Unit:"},{"$f":"Summary!R7","v":0},"sds",null,null,{"$f":"Summary!T4","v":"COUNTY"},null,"BORROWING POWER AVAILABLE UNDER NJSA 40A:2-7(g)"]
["Spec Borrowing Power",{"$f":"ROW()","v":13},{"$f":"+Summary!J4","v":"Local Unit:"},{"$f":"Summary!R7","v":0},"sds",null,null,{"$f":"Summary!T4","v":"COUNTY"}]
["Spec Borrowing Power",{"$f":"ROW()","v":14},{"$f":"+Summary!J4","v":"Local Unit:"},{"$f":"Summary!R7","v":0},"sds","bs","tapo",{"$f":"Summary!T4","v":"COUNTY"},1,"Total appropriations made in local unit budget for current fiscal year for payment of obligations of local unit included in Annual Debt Statement or revision thereof last filed as of the end of the preceding fiscal year.",null,0]
["Spec Borrowing Power",{"$f":"ROW()","v":15},{"$f":"+Summary!J4","v":"Local Unit:"},{"$f":"Summary!R7","v":0},"sds","bs","locu",{"$f":"Summary!T4","v":"COUNTY"},2,"Less the amount of such obligations which constitute utility and assessment obligations: ",null,0]
{"$rows_left_out":10}