{"text_format":"1","workbook":"xlsx","n_sheets":21,"sheets":["RegSchLookup","Muni","Summary","Local School Debt","Regional School Debt","Regional School Debt 2","Utility Debt 1","Utility Debt 2","Utility Debt 3","Utility Debt 4","Bonds Issued","Bonds Authorized","Notes Issued","Notes Authorized","Notes Authorized 2","Misc. Bonds, Notes, Loans","Deductions","Guarantees","Special Debt","Capital Leases - Not in Gross","Guarantees - Not in Gross"],"not_rendered":{"charts":0,"images":2,"macros":1,"external_links":0,"defined_names":47,"comments":0,"pivot_tables":0},"unopened":[],"bounds":{"document_bytes":16777216,"sheet_cells":100000,"rows_first":2000,"rows_last":500,"rows_between":2000,"halvings":0,"cell_chars":16384,"cell_head_chars":4096},"cells_cut":0,"cells_raw":0,"read":"whole","date_system":"1900"}

{"sheet":"RegSchLookup","index":0,"n_rows":81,"n_cols":13,"rows_kept":81,"cut":false,"hidden":true,"merged":[]}
["Regional District","School 1","School 2","School 3","School 4","School 5","School 6","School 7","School 8","School 9","School 10","School 11","School 12"]
["Andover Regional School District","Andover Borough","Andover Township"]
["Black Horse Pike Regional School District","Bellmawr Borough","Gloucester Township","Runnemede Borough"]
["Bordentown Regional School District","Bordentown City","Bordentown Township","Fieldsboro Borough"]
["Bridgewater-Raritan Regional School District","Bridgewater Township","Raritan Borough"]
["Buena Regional School District","Buena Borough","Buena Vista Township"]
{"$rows_left_out":76}
{"sheet":"Muni","index":1,"n_rows":587,"n_cols":13,"rows_kept":587,"cut":false,"hidden":true,"merged":[]}
["ENTITY NAME","CODE","COUNTY",2023,2024,2025,"3-YEAR AVERAGE","SCHOOL ","UTILITY",null,"SCHOOL %",null,"Regional School Name"]
["Aberdeen Township","1330","Monmouth",3125890785,3454220882,3702594301,{"$f":"AVERAGE(D2:F2)","v":3427568656}]
["Absecon City","0101","Atlantic",948766396,1059538473,1160915724,{"$f":"AVERAGE(D3:F3)","v":1056406864.3333334},null,null,null,0,null,"Black Horse Pike Regional School District"]
["Alexandria Township","1001","Hunterdon",963637307,1023378027,1133448600,1040154644.6666666,"Type I","Arena",null,2.5000000000000001E-2,null,"Bordentown Regional School District"]
["Allamuchy Township","2101","Warren",908686619,1004087945,1112384900,1008386488,"Type II","Affordable Housing",null,0.03,null,"Bridgewater-Raritan Regional School District"]
["Allendale Borough","0201","Bergen",2210697687,2448582994,2731131007,2463470562.6666665,null,"Airport",null,3.5000000000000003E-2,null,"Buena Regional School District"]
{"$rows_left_out":582}
{"sheet":"Summary","index":2,"n_rows":31,"n_cols":17,"rows_kept":31,"cut":false,"hidden":false,"merged":[[15,3,15,8],[10,11,10,14],[3,1,3,3],[25,4,25,12],[3,7,3,9],[3,11,3,12],[7,4,7,8],[6,4,6,8],[8,11,8,14],[9,11,9,14],[14,3,14,8],[9,4,9,8],[8,4,8,8],[11,3,11,14],[10,3,10,9],[12,3,12,13],[30,3,30,11],[27,4,27,12],[28,3,28,11],[16,3,16,8],[23,3,23,14],[19,3,19,8],[20,3,20,8],[17,3,17,8],[18,3,18,8],[26,4,26,12],[0,2,0,14],[1,2,1,14],[2,2,2,13],[6,11,6,14],[7,11,7,14]]}
[null,null,"State of New Jersey"]
[null,null,"Department of Community Affairs"]
[null,null,"Annual Debt Statement"]
[null,"Muni Code:",null,null,{"$f":"VLOOKUP(H4,Muni!A1:C589,2,FALSE)","v":{"$error":"#N/A"}},null,"Local Unit:",null,null,null,null,"County:",null,{"$f":"VLOOKUP(H4,Muni!A1:C587, 3, FALSE)","v":{"$error":"#N/A"}}]
[]
[null,null,null,null,null,null,"Budget Year Ending:",null,"December",{"$f":"IF(I6=\"December\", \"31\", \"30\")","v":"31"},null,2025,"(year)",null,null,null," "]
{"$rows_left_out":26}
{"sheet":"Local School Debt","index":3,"n_rows":33,"n_cols":6,"rows_kept":33,"cut":false,"hidden":false,"merged":[[19,1,19,3],[21,1,21,3],[14,1,14,5],[0,1,0,5],[15,1,15,5],[17,1,17,3]]}
[null,"  BONDS AND NOTES FOR LOCAL SCHOOL PURPOSES"]
[null,"If Municipality has no Local School District, check this box:"]
[null,"If Local School District has no debt, check this box:"]
[null,"Local School District Type (select one):",null,null,"Type II"]
[]
[1,"Term Bonds"]
{"$rows_left_out":28}
{"sheet":"Regional School Debt","index":4,"n_rows":37,"n_cols":17,"rows_kept":37,"cut":false,"hidden":false,"merged":[[16,7,16,13],[18,11,18,13],[0,8,0,13],[19,8,20,8],[19,10,20,10],[4,9,4,11],[18,8,18,10]]}
[null,null,null,null,null,null,null," ","BONDS AND NOTES FOR REGIONAL SCHOOL PURPOSES 1"]
[null,null,null,null,null,null,null,null,"If there is no Regional School District, check this box:"]
[null,null,null,null,null,null,null,null,"If Regional School District has no debt, check this box:"]
[]
[{"$f":"MID(CELL(\"filename\",A5),FIND(\"]\",CELL(\"filename\",A5))+1,256)","v":"Regional School Debt"},{"$f":"ROW()","v":5},{"$f":"Summary!#REF!","v":{"$error":"#REF!"}},{"$f":"Summary!L6","v":2025},"ads","bnrsp",null,null,"Regional School District Name:"]
[]
{"$rows_left_out":32}
{"sheet":"Regional School Debt 2","index":5,"n_rows":37,"n_cols":17,"rows_kept":37,"cut":false,"hidden":false,"merged":[[19,8,20,8],[19,10,20,10],[1,8,1,13],[0,8,0,13],[4,9,4,11],[16,7,16,13],[18,8,18,10],[18,11,18,13]]}
[null,null,null,null,null,null,null," ","BONDS AND NOTES FOR REGIONAL SCHOOL PURPOSES 2"]
[null,null,null,null,null,null,null,null,"*Only utilize this page if the municipality is part of more than one regional school district. "]
[null,null,null,null,null,null,null,null,"If Regional School District has no debt, check this box:"]
[]
[{"$f":"MID(CELL(\"filename\",A5),FIND(\"]\",CELL(\"filename\",A5))+1,256)","v":"Regional School Debt 2"},{"$f":"ROW()","v":5},{"$f":"Summary!#REF!","v":{"$error":"#REF!"}},{"$f":"Summary!L6","v":2025},"ads","bnrsp",null,null,"Regional School District Name:"]
[]
{"$rows_left_out":32}
{"sheet":"Utility Debt 1","index":6,"n_rows":49,"n_cols":16,"rows_kept":49,"cut":false,"hidden":false,"merged":[[43,9,43,11],[0,9,0,14],[3,9,3,11],[20,9,20,15],[21,9,21,15]]}
[{"$f":"MID(CELL(\"filename\",A1),FIND(\"]\",CELL(\"filename\",A1))+1,256)","v":"Utility Debt 1"},{"$f":"ROW()","v":1},{"$f":"Summary!D4","v":"00:00:00"},{"$f":"Summary!L6","v":"1905-07-17"},"ads","u1bn",{"$f":"F1&ROW()","v":"u1bn1"},null,null,"BONDS AND NOTES FOR UTILITY FUND"]
[null,null,null,null,null,null,null,null,null,null,"If there are no Utilities, check this box:"]
[null,null,null,null,null,null,null,null,null,null,"If Utility has no debt, check this box:"]
[{"$f":"MID(CELL(\"filename\",A4),FIND(\"]\",CELL(\"filename\",A4))+1,256)","v":"Utility Debt 1"},{"$f":"ROW()","v":4},{"$f":"Summary!D5","v":"00:00:00"},{"$f":"Summary!L7","v":"00:00:00"},"ads","u4bn",{"$f":"F4&ROW()","v":"u4bn4"},null,"I.",null,null,null,"Utility"]
["Utility Debt 1",{"$f":"ROW()","v":5},{"$f":"Summary!D4","v":"00:00:00"},{"$f":"Summary!L6","v":"1905-07-17"},"ads","u1bn",{"$f":"F5&ROW()","v":"u1bn5"},null,"1.","Term bonds",null,null,null,null,0]
["Utility Debt 1",{"$f":"ROW()","v":6},{"$f":"Summary!D4","v":"00:00:00"},{"$f":"Summary!L6","v":"1905-07-17"},"ads","u1bn","u1bn6",null,"2.","Serial bonds"]
{"$rows_left_out":44}
{"sheet":"Utility Debt 2","index":7,"n_rows":48,"n_cols":16,"rows_kept":48,"cut":false,"hidden":false,"merged":[[42,9,42,11],[0,9,0,14],[2,9,2,11],[19,9,19,15],[20,9,20,15]]}
[{"$f":"MID(CELL(\"filename\",A1),FIND(\"]\",CELL(\"filename\",A1))+1,256)","v":"Utility Debt 2"},{"$f":"ROW()","v":1},{"$f":"Summary!D4","v":"00:00:00"},{"$f":"Summary!L6","v":"1905-07-17"},"ads","u2bn",{"$f":"F1&ROW()","v":"u2bn1"},null,null,"BONDS AND NOTES FOR UTILITY FUND"]
[null,null,null,null,null,null,null,null,null,null,"If Utility has no debt, check this box:"]
[{"$f":"MID(CELL(\"filename\",A3),FIND(\"]\",CELL(\"filename\",A3))+1,256)","v":"Utility Debt 2"},{"$f":"ROW()","v":3},{"$f":"Summary!D4","v":"00:00:00"},{"$f":"Summary!L6","v":"1905-07-17"},"ads","u4bn",{"$f":"F3&ROW()","v":"u4bn3"},null,"II.",null,null,null,"Utility"]
["Utility Debt 2",{"$f":"ROW()","v":4},{"$f":"Summary!D4","v":"00:00:00"},{"$f":"Summary!L6","v":"1905-07-17"},"ads","u2bn",{"$f":"F4&ROW()","v":"u2bn4"},null,"1.","Term bonds",null,null,null,null,0]
["Utility Debt 2",{"$f":"ROW()","v":5},{"$f":"Summary!D4","v":"00:00:00"},{"$f":"Summary!L6","v":"1905-07-17"},"ads","u2bn","u2bn5",null,"2.","Serial bonds"]
["Utility Debt 2",{"$f":"ROW()","v":6},{"$f":"Summary!D4","v":"00:00:00"},{"$f":"Summary!L6","v":"1905-07-17"},"ads","u2bn","u2bn6",null,null,"(a)","Issued",null,null,null,0]
{"$rows_left_out":43}
{"sheet":"Utility Debt 3","index":8,"n_rows":48,"n_cols":16,"rows_kept":48,"cut":false,"hidden":false,"merged":[[42,9,42,11],[0,9,0,14],[2,9,2,11],[19,9,19,15],[20,9,20,15]]}
[{"$f":"MID(CELL(\"filename\",A1),FIND(\"]\",CELL(\"filename\",A1))+1,256)","v":"Utility Debt 3"},{"$f":"ROW()","v":1},{"$f":"Summary!D4","v":"00:00:00"},{"$f":"Summary!L6","v":"1905-07-17"},"ads","u3bn",{"$f":"F1&ROW()","v":"u3bn1"},null,null,"BONDS AND NOTES FOR UTILITY FUND"]
[null,null,null,null,null,null,null,null,null,null,"If Utility has no debt, check this box:"]
[{"$f":"MID(CELL(\"filename\",A3),FIND(\"]\",CELL(\"filename\",A3))+1,256)","v":"Utility Debt 3"},{"$f":"ROW()","v":3},{"$f":"Summary!D4","v":"00:00:00"},{"$f":"Summary!L6","v":"1905-07-17"},"ads","u4bn",{"$f":"F3&ROW()","v":"u4bn3"},null,"III.",null,null,null,"Utility"]
["Utility Debt 3",{"$f":"ROW()","v":4},{"$f":"Summary!D4","v":"00:00:00"},{"$f":"Summary!L6","v":"1905-07-17"},"ads","u3bn",{"$f":"F4&ROW()","v":"u3bn4"},null,"1.","Term bonds",null,null,null,null,0]
["Utility Debt 3",{"$f":"ROW()","v":5},{"$f":"Summary!D4","v":"00:00:00"},{"$f":"Summary!L6","v":"1905-07-17"},"ads","u3bn","u3bn5",null,"2.","Serial bonds"]
["Utility Debt 3",{"$f":"ROW()","v":6},{"$f":"Summary!D4","v":"00:00:00"},{"$f":"Summary!L6","v":"1905-07-17"},"ads","u3bn","u3bn6",null,null,"(a)","Issued",null,null,null,0]
{"$rows_left_out":43}
{"sheet":"Utility Debt 4","index":9,"n_rows":48,"n_cols":16,"rows_kept":48,"cut":false,"hidden":false,"merged":[[42,9,42,11],[0,9,0,14],[2,9,2,11],[19,9,19,15],[20,9,20,15]]}
[{"$f":"MID(CELL(\"filename\",A1),FIND(\"]\",CELL(\"filename\",A1))+1,256)","v":"Utility Debt 4"},{"$f":"ROW()","v":1},{"$f":"Summary!D4","v":"00:00:00"},{"$f":"Summary!L6","v":"1905-07-17"},"ads","u4bn",{"$f":"F1&ROW()","v":"u4bn1"},null,null,"BONDS AND NOTES FOR UTILITY FUND"]
[null,null,null,null,null,null,null,null,null,null,"If Utility has no debt, check this box:"]
["Utility Debt 4",{"$f":"ROW()","v":3},{"$f":"Summary!D4","v":"00:00:00"},{"$f":"Summary!L6","v":"1905-07-17"},"ads","u4bn",{"$f":"F3&ROW()","v":"u4bn3"},null,"IV.",null,null,null,"Utility"]
["Utility Debt 4",{"$f":"ROW()","v":4},{"$f":"Summary!D4","v":"00:00:00"},{"$f":"Summary!L6","v":"1905-07-17"},"ads","u4bn","u4bn4",null,"1.","Term bonds",null,null,null,null,0]
["Utility Debt 4",{"$f":"ROW()","v":5},{"$f":"Summary!D4","v":"00:00:00"},{"$f":"Summary!L6","v":"1905-07-17"},"ads","u4bn","u4bn5",null,"2.","Serial bonds"]
["Utility Debt 4",{"$f":"ROW()","v":6},{"$f":"Summary!D4","v":"00:00:00"},{"$f":"Summary!L6","v":"1905-07-17"},"ads","u4bn","u4bn6",null,null,"(a)","Issued",null,null,null,0]
{"$rows_left_out":43}
{"sheet":"Bonds Issued","index":10,"n_rows":83,"n_cols":15,"rows_kept":83,"cut":false,"hidden":false,"merged":[[0,8,0,14]]}
[{"$f":"MID(CELL(\"filename\",A1),FIND(\"]\",CELL(\"filename\",A1))+1,256)","v":"Bonds Issued"},{"$f":"ROW()","v":1},{"$f":"Summary!D4","v":"00:00:00"},{"$f":"Summary!L6","v":"1905-07-17"},"ads","bnt",{"$f":"F1&ROW()","v":"bnt1"},null,"OTHER BONDS, NOTES AND LOANS - Page 1"]
["Bonds Issued",{"$f":"ROW()","v":2},{"$f":"Summary!D4","v":"00:00:00"},{"$f":"Summary!L6","v":"1905-07-17"},"ads","bnt",{"$f":"F2&ROW()","v":"bnt2"},null,1,"TERM BONDS (state purposes separately)"]
["Bonds Issued",{"$f":"ROW()","v":3},{"$f":"Summary!D4","v":"00:00:00"},{"$f":"Summary!L6","v":"1905-07-17"},"ads","bnt","bnt3",null,null,null,"(1)",null,null,0]
["Bonds Issued",{"$f":"ROW()","v":4},{"$f":"Summary!D4","v":"00:00:00"},{"$f":"Summary!L6","v":"1905-07-17"},"ads","bnt","bnt4",null,null,null,"(2)",null,null,0]
["Bonds Issued",{"$f":"ROW()","v":5},{"$f":"Summary!D4","v":"00:00:00"},{"$f":"Summary!L6","v":"1905-07-17"},"ads","bnt","bnt5",null,null,null,"(3)",null,null,0]
["Bonds Issued",{"$f":"ROW()","v":6},{"$f":"Summary!D4","v":"00:00:00"},{"$f":"Summary!L6","v":"1905-07-17"},"ads","bnt","bnt6",null,null,null,"(4)",null,null,0]
{"$rows_left_out":78}
{"sheet":"Bonds Authorized","index":11,"n_rows":29,"n_cols":15,"rows_kept":29,"cut":false,"hidden":false,"merged":[[0,8,0,14]]}
[{"$f":"MID(CELL(\"filename\",A1),FIND(\"]\",CELL(\"filename\",A1))+1,256)","v":"Bonds Authorized"},{"$f":"ROW()","v":1},{"$f":"Summary!D4","v":"00:00:00"},{"$f":"Summary!L6","v":"1905-07-17"},"ads","bnt",{"$f":"F1&ROW()","v":"bnt1"},null,"OTHER BONDS, NOTES AND LOANS - Page 1a"]
["Bonds Authorized",{"$f":"ROW()","v":2},{"$f":"Summary!D4","v":"00:00:00"},{"$f":"Summary!L6","v":"1905-07-17"},"ads","bsa",{"$f":"F2&ROW()","v":"bsa2"},null,null,"(b)  Bonds Authorized but not Issued"]
[null,null,null,null,null,null,null,null,null,null,"(1)"]
[null,null,null,null,null,null,null,null,null,null,"(2)"]
[null,null,null,null,null,null,null,null,null,null,"(3)"]
[null,null,null,null,null,null,null,null,null,null,"(4)"]
{"$rows_left_out":24}
{"sheet":"Notes Issued","index":12,"n_rows":63,"n_cols":15,"rows_kept":63,"cut":false,"hidden":false,"merged":[[0,8,0,14]]}
[{"$f":"MID(CELL(\"filename\",A1),FIND(\"]\",CELL(\"filename\",A1))+1,256)","v":"Notes Issued"},{"$f":"ROW()","v":1},{"$f":"Summary!D4","v":"00:00:00"},{"$f":"Summary!L6","v":"1905-07-17"},"ads","bnai",{"$f":"F1&ROW()","v":"bnai1"},null,"OTHER BONDS, NOTES AND LOANS  - Page 2"]
["Notes Issued",{"$f":"ROW()","v":2},{"$f":"Summary!D4","v":"00:00:00"},{"$f":"Summary!L6","v":"1905-07-17"},"ads","ban",{"$f":"F2&ROW()","v":"ban2"},null,4,"BOND ANTICIPATION NOTES (state purposes separately)"]
["Notes Issued",{"$f":"ROW()","v":3},{"$f":"Summary!D4","v":"00:00:00"},{"$f":"Summary!L6","v":"1905-07-17"},"ads","ban","ban3",null,null,"(a)  Issued"]
["Notes Issued",{"$f":"ROW()","v":4},{"$f":"Summary!D4","v":"00:00:00"},{"$f":"Summary!L6","v":"1905-07-17"},"ads","ban","ban4",null,null,null,-1]
["Notes Issued",{"$f":"ROW()","v":5},{"$f":"Summary!D4","v":"00:00:00"},{"$f":"Summary!L6","v":"1905-07-17"},"ads","ban","ban5",null,null,null,-2]
["Notes Issued",{"$f":"ROW()","v":6},{"$f":"Summary!D4","v":"00:00:00"},{"$f":"Summary!L6","v":"1905-07-17"},"ads","ban","ban6",null,null,null,-3]
{"$rows_left_out":58}
{"sheet":"Notes Authorized","index":13,"n_rows":48,"n_cols":11,"rows_kept":48,"cut":false,"hidden":false,"merged":[[0,8,0,14]]}
[{"$f":"MID(CELL(\"filename\",A1),FIND(\"]\",CELL(\"filename\",A1))+1,256)","v":"Notes Authorized"},{"$f":"ROW()","v":1},{"$f":"Summary!D4","v":"00:00:00"},{"$f":"Summary!L6","v":"1905-07-17"},"ads","bnai",{"$f":"F1&ROW()","v":"bnai1"},null,"OTHER BONDS, NOTES AND LOANS - Page 3a"]
["Notes Authorized",{"$f":"ROW()","v":2},{"$f":"Summary!D4","v":"00:00:00"},{"$f":"Summary!L6","v":"1905-07-17"},"ads","banania",{"$f":"F2&ROW()","v":"banania2"},null,4,"BOND ANTICIPATION NOTES (state purposes separately)"]
["Notes Authorized",{"$f":"ROW()","v":3},{"$f":"Summary!D4","v":"00:00:00"},{"$f":"Summary!L6","v":"1905-07-17"},"ads","banania","banania3",null,null,"(b)  Authorized but not issued"]
["Notes Authorized",{"$f":"ROW()","v":4},{"$f":"Summary!D4","v":"00:00:00"},{"$f":"Summary!L6","v":"1905-07-17"},"ads","banania","banania4",null,null,null,-1]
["Notes Authorized",{"$f":"ROW()","v":5},{"$f":"Summary!D4","v":"00:00:00"},{"$f":"Summary!L6","v":"1905-07-17"},"ads","banania","banania5",null,null,null,-2]
["Notes Authorized",{"$f":"ROW()","v":6},{"$f":"Summary!D4","v":"00:00:00"},{"$f":"Summary!L6","v":"1905-07-17"},"ads","banania","banania6",null,null,null,-3]
{"$rows_left_out":43}
{"sheet":"Notes Authorized 2","index":14,"n_rows":49,"n_cols":15,"rows_kept":49,"cut":false,"hidden":false,"merged":[[0,8,0,14]]}
[{"$f":"MID(CELL(\"filename\",A1),FIND(\"]\",CELL(\"filename\",A1))+1,256)","v":"Notes Authorized 2"},{"$f":"ROW()","v":1},{"$f":"Summary!D4","v":"00:00:00"},{"$f":"Summary!L6","v":"1905-07-17"},"ads","bnai",{"$f":"F1&ROW()","v":"bnai1"},null,"OTHER BONDS, NOTES AND LOANS - Page 3b"]
["Notes Authorized 2",{"$f":"ROW()","v":2},{"$f":"Summary!D4","v":"00:00:00"},{"$f":"Summary!L6","v":"1905-07-17"},"ads","banania",{"$f":"F2&ROW()","v":"banania2"},null,4,"BOND ANTICIPATION NOTES (state purposes separately)"]
["Notes Authorized 2",{"$f":"ROW()","v":3},{"$f":"Summary!D4","v":"00:00:00"},{"$f":"Summary!L6","v":"1905-07-17"},"ads","banania","banania3",null,null,"(b)  Authorized but not issued (Continued)"]
["Notes Authorized 2",{"$f":"ROW()","v":4},{"$f":"Summary!D4","v":"00:00:00"},{"$f":"Summary!L6","v":"1905-07-17"},"ads","banania","banania4",null,null,null,-46]
["Notes Authorized 2",{"$f":"ROW()","v":5},{"$f":"Summary!D4","v":"00:00:00"},{"$f":"Summary!L6","v":"1905-07-17"},"ads","banania","banania5",null,null,null,-47]
["Notes Authorized 2",{"$f":"ROW()","v":6},{"$f":"Summary!D4","v":"00:00:00"},{"$f":"Summary!L6","v":"1905-07-17"},"ads","banania","banania6",null,null,null,-48]
{"$rows_left_out":44}
{"sheet":"Misc. Bonds, Notes, Loans","index":15,"n_rows":22,"n_cols":15,"rows_kept":22,"cut":false,"hidden":false,"merged":[[0,8,0,14],[2,9,2,14]]}
[{"$f":"MID(CELL(\"filename\",A1),FIND(\"]\",CELL(\"filename\",A1))+1,256)","v":"Misc. Bonds, Notes, Loans"},{"$f":"ROW()","v":1},{"$f":"Summary!D4","v":"00:00:00"},{"$f":"Summary!L6","v":"1905-07-17"},"ads","bnai",{"$f":"F1&ROW()","v":"bnai1"},null,"OTHER BONDS, NOTES AND LOANS - Page 4"]
["Misc. Bonds, Notes, Loans",{"$f":"ROW()","v":2},{"$f":"Summary!D4","v":"00:00:00"},{"$f":"Summary!L6","v":"1905-07-17"},"ads","obn",{"$f":"F2&ROW()","v":"obn2"},null,6,"MISCELLANEOUS BONDS, NOTES AND LOANS"]
["Misc. Bonds, Notes, Loans",{"$f":"ROW()","v":3},{"$f":"Summary!D4","v":"00:00:00"},{"$f":"Summary!L6","v":"1905-07-17"},"ads","obn","obn3",null,null,"(not including Tax Anticipation Notes, Emergency Notes, Special Emergency Notes and Utility Revenue Notes)"]
["Misc. Bonds, Notes, Loans",{"$f":"ROW()","v":4},{"$f":"Summary!D4","v":"00:00:00"},{"$f":"Summary!L6","v":"1905-07-17"},"ads","obni","obni4",null,null,"(a) Issued"]
["Misc. Bonds, Notes, Loans",{"$f":"ROW()","v":5},{"$f":"Summary!D4","v":"00:00:00"},{"$f":"Summary!L6","v":"1905-07-17"},"ads","obni","obni5",null,null,null,"(1)","Capital Notes (N.J.S.A. 40A:2-8)"]
["Misc. Bonds, Notes, Loans",{"$f":"ROW()","v":6},{"$f":"Summary!D4","v":"00:00:00"},{"$f":"Summary!L6","v":"1905-07-17"},"ads","obni","obni6",null,null,null,"(2)","Bonds issued by another Public Body Guaranteed by Municipality or County"]
{"$rows_left_out":17}
{"sheet":"Deductions","index":16,"n_rows":33,"n_cols":15,"rows_kept":33,"cut":false,"hidden":false,"merged":[[25,9,25,13],[0,8,0,14],[5,10,5,13],[10,10,10,13],[15,10,15,13],[23,9,23,13]]}
[{"$f":"MID(CELL(\"filename\",A1),FIND(\"]\",CELL(\"filename\",A1))+1,256)","v":"Deductions"},{"$f":"ROW()","v":1},{"$f":"Summary!D4","v":"00:00:00"},{"$f":"Summary!L6","v":"1905-07-17"},"ads","dbn",{"$f":"F1&ROW()","v":"dbn1"},null," DEDUCTIONS APPLICABLE TO OTHER BONDS AND NOTES"]
["Deductions",{"$f":"ROW()","v":2},{"$f":"Summary!D4","v":"00:00:00"},{"$f":"Summary!L6","v":"1905-07-17"},"ads","dbn",{"$f":"F2&ROW()","v":"dbn2"},null,"1.","Amounts held or to be held for the sole purpose of paying general bonds and notes included"]
["Deductions",{"$f":"ROW()","v":3},{"$f":"Summary!D4","v":"00:00:00"},{"$f":"Summary!L6","v":"1905-07-17"},"ads","dbn","dbn3",null,null,"(a)","Sinking funds on hand for term bonds"]
["Deductions",{"$f":"ROW()","v":4},{"$f":"Summary!D4","v":"00:00:00"},{"$f":"Summary!L6","v":"1905-07-17"},"ads","dbn","dbn4",null,null,null,"(1)",null,null,0]
["Deductions",{"$f":"ROW()","v":5},{"$f":"Summary!D4","v":"00:00:00"},{"$f":"Summary!L6","v":"1905-07-17"},"ads","dbn","dbn5",null,null,null,null,null,null,null,{"$f":"N4","v":0}]
["Deductions",{"$f":"ROW()","v":6},{"$f":"Summary!D4","v":"00:00:00"},{"$f":"Summary!L6","v":"1905-07-17"},"ads","dbn","dbn6",null,null,"(b)","Funds on hand (including proceeds of bonds and notes held to pay other bonds and notes), in those cases where such funds cannot be diverted to purposes other than the payment of bonds and notes"]
{"$rows_left_out":28}
{"sheet":"Guarantees","index":17,"n_rows":53,"n_cols":15,"rows_kept":53,"cut":false,"hidden":false,"merged":[[0,8,0,14],[52,11,52,13]]}
[{"$f":"MID(CELL(\"filename\",A1),FIND(\"]\",CELL(\"filename\",A1))+1,256)","v":"Guarantees"},{"$f":"ROW()","v":1},{"$f":"Summary!D4","v":0},{"$f":"Summary!L6","v":2025},"ads","gic",{"$f":"F1&ROW()","v":"gic1"},null,"Bonds authorized/issued by another Public Body to be guaranteed by the municipality"]
["Guarantees",{"$f":"ROW()","v":2},{"$f":"Summary!D4","v":0},{"$f":"Summary!L6","v":2025},"ads","gic",{"$f":"F2&ROW()","v":"gic2"}]
["Guarantees",{"$f":"ROW()","v":3},{"$f":"Summary!D4","v":0},{"$f":"Summary!L6","v":2025},"ads","gic","gic3",null,null,null,-1]
["Guarantees",{"$f":"ROW()","v":4},{"$f":"Summary!D4","v":0},{"$f":"Summary!L6","v":2025},"ads","gic","gic4",null,null,null,-2]
["Guarantees",{"$f":"ROW()","v":5},{"$f":"Summary!D4","v":0},{"$f":"Summary!L6","v":2025},"ads","gic","gic5",null,null,null,-3]
["Guarantees",{"$f":"ROW()","v":6},{"$f":"Summary!D4","v":0},{"$f":"Summary!L6","v":2025},"ads","gic","gic6",null,null,null,-4,null,null,0]
{"$rows_left_out":48}
{"sheet":"Special Debt","index":18,"n_rows":21,"n_cols":17,"rows_kept":21,"cut":false,"hidden":false,"merged":[[1,9,1,16],[0,9,0,16],[15,9,15,15]]}
[{"$f":"MID(CELL(\"filename\",A1),FIND(\"]\",CELL(\"filename\",A1))+1,256)","v":"Special Debt"},{"$f":"ROW()","v":"1900-01-01"},{"$f":"Summary!D4","v":"00:00:00"},{"$f":"Summary!L6","v":"1905-07-17"},"ads","spd",{"$f":"F1&ROW()","v":"spd1"},null,null,"SPECIAL DEBT STATEMENT BORROWING POWER "]
["Special Debt",{"$f":"ROW()","v":"1900-01-02"},{"$f":"Summary!D4","v":"00:00:00"},{"$f":"Summary!L6","v":"1905-07-17"},"ads","spd",{"$f":"F2&ROW()","v":"spd2"},null,null,"AVAILABLE UNDER N.J.S.A. 40A:2-7(f)"]
[]
["Special Debt",{"$f":"ROW()","v":"1900-01-04"},{"$f":"Summary!D4","v":"00:00:00"},{"$f":"Summary!L6","v":"1905-07-17"},"ads","spd","spd4",null,"1.",{"$f":"\"Balance of debt incurring capacity \"&_xlfn.CONCAT(Summary!I6,\" \",Summary!J6,\", \",Summary!L6-1&\" (NJSA 40:1-16(d))\")","v":"Balance of debt incurring capacity December 31, 2024 (NJSA 40:1-16(d))"},null,null,null,null,null,null,0]
["Special Debt",{"$f":"ROW()","v":"1900-01-05"},{"$f":"Summary!D4","v":"00:00:00"},{"$f":"Summary!L6","v":"1905-07-17"},"ads","spd","spd5"]
["Special Debt",{"$f":"ROW()","v":"1900-01-06"},{"$f":"Summary!D4","v":"00:00:00"},{"$f":"Summary!L6","v":"1905-07-17"},"ads","spd","spd6",null,"2.",{"$f":"\"Obligations heretofore authorized during \"&Summary!L6&\" in\"","v":"Obligations heretofore authorized during 2025 in"}]
{"$rows_left_out":16}
{"sheet":"Capital Leases - Not in Gross","index":19,"n_rows":54,"n_cols":15,"rows_kept":54,"cut":false,"hidden":false,"merged":[[0,8,0,14]]}
[{"$f":"MID(CELL(\"filename\",A1),FIND(\"]\",CELL(\"filename\",A1))+1,256)","v":"Capital Leases - Not in Gross"},{"$f":"ROW()","v":1},{"$f":"Summary!D4","v":0},{"$f":"Summary!L6","v":2025},"ads","clo",{"$f":"F1&ROW()","v":"clo1"},null,"Obligations NOT Included in Gross Debt"]
["Capital Leases - Not in Gross",{"$f":"ROW()","v":2},{"$f":"Summary!D4","v":0},{"$f":"Summary!L6","v":2025},"ads","clo",{"$f":"F2&ROW()","v":"clo2"},null,1,"Capital Leases and Other Comittments"]
["Capital Leases - Not in Gross",{"$f":"ROW()","v":3},{"$f":"Summary!D4","v":0},{"$f":"Summary!L6","v":2025},"ads","clo","clo3",null,null,null,-1,null,null,0]
["Capital Leases - Not in Gross",{"$f":"ROW()","v":4},{"$f":"Summary!D4","v":0},{"$f":"Summary!L6","v":2025},"ads","clo","clo4",null,null,null,-2,null,null,0]
["Capital Leases - Not in Gross",{"$f":"ROW()","v":5},{"$f":"Summary!D4","v":0},{"$f":"Summary!L6","v":2025},"ads","clo","clo5",null,null,null,-3,null,null,0]
["Capital Leases - Not in Gross",{"$f":"ROW()","v":6},{"$f":"Summary!D4","v":0},{"$f":"Summary!L6","v":2025},"ads","clo","clo6",null,null,null,-4,null,null,0]
{"$rows_left_out":49}
{"sheet":"Guarantees - Not in Gross","index":20,"n_rows":54,"n_cols":15,"rows_kept":54,"cut":false,"hidden":false,"merged":[[0,8,0,14]]}
[{"$f":"MID(CELL(\"filename\",A1),FIND(\"]\",CELL(\"filename\",A1))+1,256)","v":"Guarantees - Not in Gross"},{"$f":"ROW()","v":1},{"$f":"Summary!D4","v":0},{"$f":"Summary!L6","v":2025},"ads","gnic",{"$f":"F1&ROW()","v":"gnic1"},null,"Obligations NOT Included in Gross Debt"]
["Guarantees - Not in Gross",{"$f":"ROW()","v":2},{"$f":"Summary!D4","v":0},{"$f":"Summary!L6","v":2025},"ads","gnic",{"$f":"F2&ROW()","v":"gnic2"},null,2,"Guarantees NOT included in Gross Debt - Public and Private"]
["Guarantees - Not in Gross",{"$f":"ROW()","v":3},{"$f":"Summary!D4","v":0},{"$f":"Summary!L6","v":2025},"ads","gnic","gnic3",null,null,null,-1,null,null,0]
["Guarantees - Not in Gross",{"$f":"ROW()","v":4},{"$f":"Summary!D4","v":0},{"$f":"Summary!L6","v":2025},"ads","gnic","gnic4",null,null,null,-2,null,null,0]
["Guarantees - Not in Gross",{"$f":"ROW()","v":5},{"$f":"Summary!D4","v":0},{"$f":"Summary!L6","v":2025},"ads","gnic","gnic5",null,null,null,-3,null,null,0]
["Guarantees - Not in Gross",{"$f":"ROW()","v":6},{"$f":"Summary!D4","v":0},{"$f":"Summary!L6","v":2025},"ads","gnic","gnic6",null,null,null,-4,null,null,0]
{"$rows_left_out":48}