{"text_format":"1","workbook":"xlsx","n_sheets":5,"sheets":["Muni","Instructions","CURRENT MAYORS LIST ","Key Inputs","MUNICIPAL CONTACT LIST UPDATE "],"not_rendered":{"charts":0,"images":2,"macros":0,"external_links":0,"defined_names":15,"comments":0,"pivot_tables":0},"unopened":[],"bounds":{"document_bytes":16777216,"sheet_cells":100000,"rows_first":2000,"rows_last":500,"rows_between":2000,"halvings":0,"cell_chars":16384,"cell_head_chars":4096},"cells_cut":0,"cells_raw":0,"read":"whole","date_system":"1900"}

{"sheet":"Muni","index":0,"n_rows":586,"n_cols":14,"rows_kept":586,"cut":false,"hidden":true,"merged":[]}
["MUNICIPALITY NAME","MUNICIPALITY NAME","CODE","COUNTY",2022,2023,2024,"3-YEAR AVERAGE","SCHOOL ","UTILITY",null,"SCHOOL %",null,"Regional School Name"]
["Aberdeen Township",{"$f":"A2&\", \"&D2&\" County\"","v":"Aberdeen Township, Monmouth County"},"1330","Monmouth",2850322221,3125890785,3454220882,{"$f":"AVERAGE(E2:G2)","v":3143477962.6666665}]
["Absecon City",{"$f":"A3&\", \"&D3&\" County\"","v":"Absecon City, Atlantic County"},"0101","Atlantic",857513986,948766396,1059538473,{"$f":"AVERAGE(E3:G3)","v":955272951.66666663},null,null,null,0,null,"Black Horse Pike Regional School District"]
["Alexandria Township","Alexandria Township, Hunterdon County","1001","Hunterdon",886478833,963637307,1023378027,957831389,"Type I","Arena",null,2.5000000000000001E-2,null,"Bordentown Regional School District"]
["Allamuchy Township","Allamuchy Township, Warren County","2101","Warren",844022228,908686619,1004087945,918932264,"Type II","Affordable Housing",null,0.03,null,"Bridgewater-Raritan Regional School District"]
["Allendale Borough","Allendale Borough, Bergen County","0201","Bergen",2075748594,2210697687,2448582994,2245009758.3333335,null,"Airport",null,3.5000000000000003E-2,null,"Buena Regional School District"]
["Allenhurst Borough","Allenhurst Borough, Monmouth County","1301","Monmouth",976186662,1461222836,1462314264,1299907920.6666667,null,"Beach",null,0.04,null,"Caldwell-West Caldwell Consolidated School District"]
["Allentown Borough","Allentown Borough, Monmouth County","1302","Monmouth",199377689,247591026,290113947,245694220.66666666,null,"Electric",null,null,null,"Carlstadt-East Rutherford Regional High School"]
["Alloway Township","Alloway Township, Salem County","1701","Salem",331411333,389360960,406222772,375665021.66666669,null,"Golf Course",null,null,null,"Central Regional School District"]
["Alpha Borough","Alpha Borough, Warren County","2102","Warren",242982939,275308421,315051334,277780898,null,"Harbor",null,null,null,"Chatham School District"]
["Alpine Borough","Alpine Borough, Bergen County","0202","Bergen",1880436604,2083185419,2091566133,2018396052,null,"Ice Rink",null,null,null,"Chester Township Consolidated School District"]
["Andover Borough","Andover Borough, Sussex County","1901","Sussex",83005193,83403009,94112207,86840136.333333328,null,"Marina",null,null,null,"Clearview Regional School District"]
["Andover Township","Andover Township, Sussex County","1902","Sussex",869957194,918694059,1022235610,936962287.66666663,null,"Parking ",null,null,null,"Clinton-Glen Gardner School District"]
["Asbury Park City","Asbury Park City, Monmouth County","1303","Monmouth",2483123847,2800143553,3212152473,2831806624.3333335,null,"Recreation",null,null,null,"Cumberland Regional High School"]
["Atlantic City","Atlantic City, Atlantic County","0102","Atlantic",3186835403,3448065018,3702839432,3445913284.3333335,null,"Sewer",null,null,null,"Delaware Valley Regional High School"]
["Atlantic County",{"$f":"A16","v":"Atlantic County"},"0100","Atlantic",39369894998,45466690306,50966763923,45267783075.666664,null,"Solid Waste",null,null,null,"Delsea Regional School District"]
["Atlantic Highlands Borough","Atlantic Highlands Borough, Monmouth County","1304","Monmouth",1083114471,1178354088,1273730593,1178399717.3333333,null,"Swimming Pool",null,null,null,"East Windsor Regional School District"]
["Audubon Borough","Audubon Borough, Camden County","0401","Camden",871758655,978049415,1055827842,968545304,null,"Water",null,null,null,"Eastern Camden County Regional High School"]
["Audubon Park Borough","Audubon Park Borough, Camden County","0402","Camden",20722795,20722795,20722795,20722795,null,"Water & Sewer",null,null,null,"Flemington-Raritan Regional School District"]
["Avalon Borough","Avalon Borough, Cape May County","0501","Cape May",14004552620,15944352184,17323253528,15757386110.666666,null,"Other",null,null,null,"Freehold Regional High School District"]
["Avon-by-the-Sea Borough","Avon-by-the-Sea Borough, Monmouth County","1305","Monmouth",1457074761,1538744186,1799980029,1598599658.6666667,null,null,null,null,null,"Gateway Regional School District"]
["Barnegat Light Borough","Barnegat Light Borough, Ocean County","1501","Ocean",1330053342,1717464338,1979872907,1675796862.3333333,null,null,null,null,null,"Great Meadows Regional School District"]
["Barnegat Township","Barnegat Township, Ocean County","1533","Ocean",3476713249,4055988867,4514819713,4015840609.6666665,null,null,null,null,null,"Greater Egg Harbor Regional High School"]
["Barrington Borough","Barrington Borough, Camden County","0403","Camden",645158362,739497459,816895837,733850552.66666663,null,null,null,null,null,"Hanover Park Regional High School District"]
["Bass River Township","Bass River Township, Burlington County","0301","Burlington",201767045,225787922,246997741,224850902.66666666,null,null,null,null,null,"Henry Hudson Regional High School"]
["Bay Head Borough","Bay Head Borough, Ocean County","1502","Ocean",2183708948,2457873223,2859005640,2500195937,null,null,null,null,null,"High Point Regional High School"]
["Bayonne City","Bayonne City, Hudson County","0901","Hudson",9054404667,10189024075,10833452449,10025627063.666666,null,null,null,null,null,"Hopewell Valley Regional School District"]
["Beach Haven Borough","Beach Haven Borough, Ocean County","1503","Ocean",3143620523,3691558778,4064535847,3633238382.6666665,null,null,null,null,null,"Hunterdon Central Regional High School"]
["Beachwood Borough","Beachwood Borough, Ocean County","1504","Ocean",1176326812,1337524365,1476397187,1330082788,null,null,null,null,null,"Kingsway Regional School District"]
["Bedminster Township","Bedminster Township, Somerset County","1801","Somerset",2619810530,2677135694,2733574308,2676840177.3333335,null,null,null,null,null,"Kittatinny Regional High School"]
["Belleville Township","Belleville Township, Essex County","0701","Essex",3767732740,4193145253,4763242036,4241373343,null,null,null,null,null,"Lakeland Regional High School"]
["Bellmawr Borough","Bellmawr Borough, Camden County","0404","Camden",888341649,1016548427,1093710823,999533633,null,null,null,null,null,"Lenape Regional High School District"]
["Belmar Borough","Belmar Borough, Monmouth County","1306","Monmouth",2360426956,2593724280,2920742698,2624964644.6666665,null,null,null,null,null,"Lenape Valley Regional High School"]
["Belvidere Town","Belvidere Town, Warren County","2103","Warren",235502827,232850755,276130030,248161204,null,null,null,null,null,"Long Beach Island Consolidated School District"]
["Bergen County",{"$f":"A35","v":"Bergen County"},"0200","Bergen",209970578578,226848381422,244730595430,227183185143.33334,null,null,null,null,null,"Lower Cape May Regional High School"]
["Bergenfield Borough","Bergenfield Borough, Bergen County","0203","Bergen",3777567913,4090610419,4644599932,4170926088,null,null,null,null,null,"Mainland Regional High School"]
["Berkeley Heights Township","Berkeley Heights Township, Union County","2001","Union",3694801857,3986580542,4416365516,4032582638.3333335,null,null,null,null,null,"Manalapan-Englishtown Regional School District"]
["Berkeley Township","Berkeley Township, Ocean County","1505","Ocean",7578702079,8530244253,9321660273,8476868868.333333,null,null,null,null,null,"Matawan-Aberdeen Regional School District"]
["Berlin Borough","Berlin Borough, Camden County","0405","Camden",897129078,994312789,1106959840,999467235.66666663,null,null,null,null,null,"Monmouth Regional High School District"]
["Berlin Township","Berlin Township, Camden County","0406","Camden",787725316,883385665,999120762,890077247.66666663,null,null,null,null,null,"Montgomery Township School District"]
{"$rows_left_out":547}
{"sheet":"Instructions","index":1,"n_rows":13,"n_cols":2,"rows_kept":13,"cut":false,"hidden":false,"merged":[]}
[null,"Mayors and Municipal Contact List Update Form"]
[null,"Instruction Manual"]
["a)","This workbook shall be used for completing the Mayors and Municipal Contact List Update form."]
["b)","Begin by navigating to the \"CURRENT MAYORS LIST\" tab."]
["c)","Find your municipality in the MUNI NAME column using \"Find and Replace\" (CTRL + F)."]
["d)","Review the current contact information for the Mayor."]
["e)","Navigate to the \"Key Inputs\" tab."]
["f)","Select the Municipality by clicking on the arrow on the right side and typing in the entity name. This will populate the entity name and county. This will fill in the MUNI CODE and MUNI NAME columns on the \"MUNICIPAL CONTACT LIST UPDATE\" tab."]
["g)","Navigate to the \"MUNICIPAL CONTACT LIST UPDATE\" tab."]
["h)","Fill in all relevant columns starting with FIRST NAME for each title listed in the TITLE column."]
["i)","Make note of the MUNI CODE for your municipality."]
["j)","Save as <MUNICODE>_contactlist_YEAR with YEAR as a 4-digit number."]
["k)","Return document via email to: egg@dca.nj.gov."]

{"sheet":"CURRENT MAYORS LIST ","index":2,"n_rows":565,"n_cols":17,"rows_kept":565,"cut":false,"hidden":false,"merged":[]}
["MUNI CODE","MUNI NAME","COUNTY","ADDRESS 1","ADDRESS 2","CITY","STATE","ZIP","PHONE","FAX","MAYOR NAME","TERM START","TERM END","FORM","TERM LEGNTH","EMAIL","SOCIAL MEDIA HANDLE"]
[101,"Absecon City","Atlantic","Absecon Municipal Complex","500 Mill Road","Absecon","NJ",8201,"(609) 641-0663","(609) 645-5098","Thomas Marrone",null,"2025-12-31","MAYOR-COUNCIL",3,"tmarrone@abseconnj.org"]
[102,"Atlantic City","Atlantic","City Hall","1301 Bacharach Boulevard","Atlantic City","NJ",8401,"(609) 347-5300","(609) 437-5638","Marty Small, Sr.",null,"2025-12-31",null,null,"msmall@acnj.gov"]
[103,"Brigantine City","Atlantic","1417 West Brigantine Avenue",null,"Brigantine","NJ","08203-2147","(609) 266-7600",null,"Vince Sera ",null,"2026-12-31",null,null,"vsera@brigantinebeachnj.com"]
[104,"Buena Borough","Atlantic","616 Central Avenue",null,"Minotola","NJ",8341,"(856) 697-9393",null,"Joseph Baruffi","2024-01-01","2027-12-31",null,"4 year","joseph.baruffi@buenaboro.org"]
[105,"Buena Vista Township","Atlantic","890 Harding Highway","Post Office Box 605","Buena","NJ",8310,"(856) 697-2100","(856) 697-8353","William Ruggieri",null,"2025-12-31",null,null,"wruggieri@buenavistanj.com"]
[106,"Corbin City","Atlantic","316 Route 50",null,"Corbin City","NJ",8270,"(609) 701-0200","(609) 628-3017","Robert Schulte ",null,"2026-12-31","Mayor-Council",null,"mayorschulte@corbincitynj.com "]
[107,"Egg Harbor City","Atlantic","500 London Avenue",null,"Egg Harbor City","NJ","08215-1599","(609) 965-4683","(609) 965-6698","Lisa Jiampetti",null,"2028-12-31",null,null," jiams208@comcast.net"]
[108,"Egg Harbor Township","Atlantic","3515 Bargaintown Road",null,"Egg Harbor Township","NJ","08234-8321","(609) 926-4088",null,"Laura Pfrommer",null,"2025-12-31",null,null,"LPfrommer@ehtgov.org"]
[109,"Estell Manor City","Atlantic","148 Cumberland Avenue",null,"Estell Manor","NJ",8319,"(609) 476-2692",null,"Elizabeth Owen",null,"2025-12-31",null,null,"eowen@estellmanor.org"]
[110,"Folsom Borough","Atlantic","1700 Twelfth Street",null,"Folsom","NJ","08037-9141","(609) 561-3178",null,"Glenn Smith",null,"2027-12-31",null,null,"gsmith@folsomborough.com"]
[111,"Galloway Township","Atlantic","300 East Jimmie Leeds Road",null,"Galloway","NJ",8205,"(609) 652-3700","(609) 652-1967","Anthony Coppola, Jr.",null,"2027-12-31",null,null,"acoppola@gtnj.org"]
[112,"Hamilton Township","Atlantic","6101 Thirteenth Street",null,"Mays Landing","NJ","08330-1859","(609) 625-1511",null,"Art Schenker",null,"2025-12-31",null,null,"mayor@hamiltonatlnj.gov"]
[113,"Hammonton Town","Atlantic","100 Central Avenue",null,"Hammonton","NJ",8037,"(609) 567-4300",null,"Stephen DiDonato",null,"2025-12-31",null,null,"sdidonato@townofhammonton.org"]
[114,"Linwood City","Atlantic","400 Poplar Avenue",null,"Linwood","NJ",8221,"(609) 927-4108",null,"Darren Matik",null,"2027-12-31",null,null,"dmatik@linwoodcity.org"]
[115,"Longport Borough","Atlantic","2305 Atlantic Avenue",null,"Longport","NJ",8403,"(609) 823-7514",null,"Patrick Armstrong ",null,"2029-01-14",null,null,"clerk@longport-nj.us"]
[116,"Margate City","Atlantic","One South Washington Avenue",null,"Margate","NJ","08402-2301","(609) 822-2605",null,"Michael Collins ",null,"2027-05-09",null,4,"mcollins@margate-nj.com"]
[117,"Mullica Township","Atlantic","4528 White Horse Pike","Post Office Box 317","Elwood","NJ",8217,"(609) 561-0064","(609) 561-3031","DeAnna DeMarco",null,"2025-12-31",null,null,"ddemarco@mullicatownship.org"]
[118,"Northfield City","Atlantic","1600 Shore Road",null,"Northfield","NJ","08225-2201","(609) 641-2832",null,"Erland Chau",null,"2027-12-31",null,null,"echau@cityofnorthfield.org"]
[119,"Pleasantville City","Atlantic","18 North 1st Street",null,"Pleasantville","NJ","08232-2604","(609) 484-3600",null,"Judy M. Ward",null,"2025-12-31",null,null,"mayorward@pleasantvillenj.us"]
[120,"Port Republic City","Atlantic","143 Main Street",null,"Port Republic","NJ",8241,"(609) 652-1501",null,"Monica \"Niki\" Giberson",null,"2025-12-31",null,null,"mayor@portrepublicnj.org"]
[121,"Somers Point City","Atlantic","City Hall","One West New Jersey Avenue","Somers Point","NJ",8244,"(609) 927-9088",null,"Dennis Tapp",null,"2026-12-31",null,null,"dtapp@spgov.org"]
[122,"Ventnor City","Atlantic","City Hall","6201 Atlantic Avenue","Ventnor","NJ","08406-2734","(609) 823-7900",null,"H. Timothy Kriebel",null,"2028-05-14",null,null,"tkriebel@ventnorcity.org"]
[123,"Weymouth Township","Atlantic","45 South Jersey Avenue",null,"Dorothy","NJ",8317,"(609) 476-2633","(609) 476-4466","Kenneth R. Haeser",null,"2025-12-31",null,null,"mayor@weymouthnj.org"]
[201,"Allendale Borough","Bergen","500 West Crescent Avenue",null,"Allendale","NJ",7401,"(201) 818-4400",null,"Amy Wilczynski",null,"2026-12-31",null,"4 year","AmyWilczynski@allendalenj.gov"]
[202,"Alpine Borough","Bergen","100 Church Street","Post Office Box 1095","Alpine","NJ","07620-1095","(201) 784-2900","(201) 784-1407","Paul H. Tomasko",null,"2026-12-31","Mayor/Council","4 year","swehmann@alpinenj.org; "]
[203,"Bergenfield Borough","Bergen","198 North Washington Avenue",null,"Bergenfield","NJ",7621,"(201) 387-4055","(201) 385-7689","Arvin Amatorio","2024-01-01","2027-12-31",null,4,"AAmatorio@bergenfieldnj.gov"]
[204,"Bogota Borough","Bergen","375 Larch Avenue",null,"Bogota","NJ","07603-1099","(201) 342-1736",null,"Daniele Fede ",null,"2027-12-31",null,"4 year","mayorfede@bogotaonline.org"]
[205,"Carlstadt Borough","Bergen","500 Madison Street",null,"Carlstadt","NJ",7072,"(201) 939-2850",null,"Robert Zimmermann",null,"2027-12-31",null,null,"robert.zimmermann@verizon.net"]
[206,"Cliffside Park Borough","Bergen","525 Palisade Avenue",null,"Cliffside Park","NJ",7010,"(201) 945-3456",null,"Thomas.Calabrese",null,"2026-12-31",null,null,"Tcalabrese@cliffsideparknj.gov"]
[207,"Closter Borough","Bergen","295 Closter Dock Road",null,"Closter","NJ","07624-2645","(201) 784-0600","(201) 784-9727","John C. Glidden, Jr.",null,"2026-12-31",null,null,"mayor@closternj.us"]
[208,"Cresskill Borough","Bergen","67 Union Avenue",null,"Cresskill","NJ",7626,"(201) 569-5400","(201) 569-3714","Benedict Romeo",null,"2025-12-31",null,null,"bnasuto.boro@cresskillboro.org"]
[209,"Demarest Borough","Bergen","118 Serpentine Road",null,"Demarest","NJ",7627,"(201) 768-0167",null,"Brian Bernstein",null,"2026-12-31",null,null,"mayor@demarestnj.gov"]
[210,"Dumont Borough","Bergen","50 Washington Avenue",null,"Dumont","NJ",7628,"(201) 387-5022",null,"John W. Russell III",null,"2027-12-31",null,null,"jrussell@dumontboro.org"]
[211,"Elmwood Park Borough","Bergen","182 Market Street",null,"Elmwood Park","NJ","07407-1407","(201) 796-1457",null,"Robert Colletti",null,"2027-12-31",null,"4 year","RColleti@elmwoodparknj.us"]
[212,"East Rutherford Borough","Bergen","One Everett Place",null,"East Rutherford","NJ","07073-1701","(201) 933-3444",null,"Jeffrey J. Lahullier",null,"2027-12-31",null,null,"mayorlahullier@eastrutherfordnj.net"]
[213,"Edgewater Borough","Bergen","916 River Road",null,"Edgewater","NJ",7020,"(201) 943-1700",null,"Michael McPartland",null,"2027-12-31",null,null,"mayorMcpartland@edgewaternj.org"]
[214,"Emerson Borough","Bergen","Municipal Place",null,"Emerson","NJ","07630-1891","(201) 262-6086",null,"Danielle DiPaola",null,"2026-12-31",null,null,"Mayor@emersonnj.org"]
[215,"Englewood City","Bergen","2-10 North Van Brunt Street",null,"Englewood","NJ",7631,"(201) 871-6636","(201) 567-3678","Michael Wildes",null,"2025-12-31",null,null,"MayorWildes@cityofenglewood.org "]
[216,"Englewood Cliffs Borough","Bergen","482 Hudson Terrace",null,"Englewood Cliffs","NJ","07632-2911","(201) 569-5252",null,"Mark Park",null,"2027-12-31",null,null,"mpark@englewoodcliffsnj.org"]
{"$rows_left_out":526}
{"sheet":"Key Inputs","index":3,"n_rows":9,"n_cols":9,"rows_kept":9,"cut":false,"hidden":false,"merged":[[1,1,1,11],[2,1,2,11],[4,1,4,11],[6,6,6,11]]}
[]
[null,"State of New Jersey"]
[null,"Department of Community Affairs"]
[]
[null,"Municipal Contact List and Mayors List Update"]
[]
[null,"     Please choose your municipality:",null,null,null,null,"Allentown Borough, Monmouth County"]
[]
[null,"     Muni Code:",null,{"$f":"VLOOKUP(G7,Muni!B1:D588,2,FALSE)","v":"1302"},null,null,"County:",null,{"$f":"VLOOKUP(G7,Muni!B1:E586, 3, FALSE)","v":"Monmouth"}]

{"sheet":"MUNICIPAL CONTACT LIST UPDATE ","index":4,"n_rows":40,"n_cols":17,"rows_kept":40,"cut":false,"hidden":false,"merged":[[0,0,0,16]]}
["                                                                                                                              2025 MUNICIPAL CONTACT LIST UPDATE"]
[]
[]
["MUNI CODE","TITLE ","MUNI NAME","FIRST NAME ","LAST NAME ","EMAIL ","PHONE NUMBER ","EXTENSION","COUNTY","ADDRESS 1","ADDRESS 2","CITY","STATE","ZIP","MAYORS TERM START","MAYORS TERM END","FORM OF GOVERNMENT "]
[{"$f":"'Key Inputs'!$D$9","v":"1302"},"Mayor ",{"$f":"'Key Inputs'!$G$7","v":"Allentown Borough, Monmouth County"}]
[{"$f":"'Key Inputs'!$D$9","v":"1302"},"Business Administrator or Manager ",{"$f":"'Key Inputs'!$G$7","v":"Allentown Borough, Monmouth County"}]
[{"$f":"'Key Inputs'!$D$9","v":"1302"},"Assistant Business Administrator or Manager",{"$f":"'Key Inputs'!$G$7","v":"Allentown Borough, Monmouth County"}]
[{"$f":"'Key Inputs'!$D$9","v":"1302"},"Clerk",{"$f":"'Key Inputs'!$G$7","v":"Allentown Borough, Monmouth County"}]
[{"$f":"'Key Inputs'!$D$9","v":"1302"},"Deputy Clerk",{"$f":"'Key Inputs'!$G$7","v":"Allentown Borough, Monmouth County"}]
[{"$f":"'Key Inputs'!$D$9","v":"1302"},"Finance Officer ",{"$f":"'Key Inputs'!$G$7","v":"Allentown Borough, Monmouth County"}]
[{"$f":"'Key Inputs'!$D$9","v":"1302"},"Assistant Finance Officer",{"$f":"'Key Inputs'!$G$7","v":"Allentown Borough, Monmouth County"}]
[{"$f":"'Key Inputs'!$D$9","v":"1302"},"Municipal Auditor",{"$f":"'Key Inputs'!$G$7","v":"Allentown Borough, Monmouth County"}]
[{"$f":"'Key Inputs'!$D$9","v":"1302"},"Public Works Manager",{"$f":"'Key Inputs'!$G$7","v":"Allentown Borough, Monmouth County"}]
[{"$f":"'Key Inputs'!$D$9","v":"1302"},"Tax Collector",{"$f":"'Key Inputs'!$G$7","v":"Allentown Borough, Monmouth County"}]
[{"$f":"'Key Inputs'!$D$9","v":"1302"},"Purchasing Agent/QPA 1",{"$f":"'Key Inputs'!$G$7","v":"Allentown Borough, Monmouth County"}]
[{"$f":"'Key Inputs'!$D$9","v":"1302"},"Purchasing Agent/QPA 2",{"$f":"'Key Inputs'!$G$7","v":"Allentown Borough, Monmouth County"}]
[{"$f":"'Key Inputs'!$D$9","v":"1302"},"Purchasing Agent/QPA 3",{"$f":"'Key Inputs'!$G$7","v":"Allentown Borough, Monmouth County"}]
[{"$f":"'Key Inputs'!$D$9","v":"1302"},"Fire District",{"$f":"'Key Inputs'!$G$7","v":"Allentown Borough, Monmouth County"}]
[{"$f":"'Key Inputs'!$D$9","v":"1302"},"Housing Authority (if applicable) ",{"$f":"'Key Inputs'!$G$7","v":"Allentown Borough, Monmouth County"}]
[{"$f":"'Key Inputs'!$D$9","v":"1302"},"Utility Authority - MUA (if applicable) ",{"$f":"'Key Inputs'!$G$7","v":"Allentown Borough, Monmouth County"}]
[{"$f":"'Key Inputs'!$D$9","v":"1302"},"School Business Administrator ",{"$f":"'Key Inputs'!$G$7","v":"Allentown Borough, Monmouth County"}]
[{"$f":"'Key Inputs'!$D$9","v":"1302"},"School Business Administrator  1 (If needed) ",{"$f":"'Key Inputs'!$G$7","v":"Allentown Borough, Monmouth County"}]
[{"$f":"'Key Inputs'!$D$9","v":"1302"},"School Business Administrator  2 (If needed) ",{"$f":"'Key Inputs'!$G$7","v":"Allentown Borough, Monmouth County"}]
[{"$f":"'Key Inputs'!$D$9","v":"1302"},"School Business Administrator 3 (If needed) ",{"$f":"'Key Inputs'!$G$7","v":"Allentown Borough, Monmouth County"}]
[{"$f":"'Key Inputs'!$D$9","v":"1302"},"School Business Administrator 4 (If needed) ",{"$f":"'Key Inputs'!$G$7","v":"Allentown Borough, Monmouth County"}]
[{"$f":"'Key Inputs'!$D$9","v":"1302"},"School Business Administrator 5 (If needed) ",{"$f":"'Key Inputs'!$G$7","v":"Allentown Borough, Monmouth County"}]
[{"$f":"'Key Inputs'!$D$9","v":"1302"},"School Business Administrator 6 (If needed) ",{"$f":"'Key Inputs'!$G$7","v":"Allentown Borough, Monmouth County"}]
[{"$f":"'Key Inputs'!$D$9","v":"1302"},"School Business Administrator 7 (If needed) ",{"$f":"'Key Inputs'!$G$7","v":"Allentown Borough, Monmouth County"}]
[{"$f":"'Key Inputs'!$D$9","v":"1302"},"School Business Administrator 8 (If needed) ",{"$f":"'Key Inputs'!$G$7","v":"Allentown Borough, Monmouth County"}]
[{"$f":"'Key Inputs'!$D$9","v":"1302"},"School Business Administrator 9 (If needed) ",{"$f":"'Key Inputs'!$G$7","v":"Allentown Borough, Monmouth County"}]
[{"$f":"'Key Inputs'!$D$9","v":"1302"},"School Business Administrator 10 (If needed) ",{"$f":"'Key Inputs'!$G$7","v":"Allentown Borough, Monmouth County"}]
[{"$f":"'Key Inputs'!$D$9","v":"1302"},"School Business Administrator 11 (If needed) ",{"$f":"'Key Inputs'!$G$7","v":"Allentown Borough, Monmouth County"}]
[{"$f":"'Key Inputs'!$D$9","v":"1302"},"School Business Administrator 12 (If needed) ",{"$f":"'Key Inputs'!$G$7","v":"Allentown Borough, Monmouth County"}]
[{"$f":"'Key Inputs'!$D$9","v":"1302"},"School Business Administrator 13 (If needed) ",{"$f":"'Key Inputs'!$G$7","v":"Allentown Borough, Monmouth County"}]
[]
[]
[]
[]
[null,"Current Mayors List  2025"]
[null,"NJ Mayors Directory | NJOIT Open Data Center"]