{"text_format":"1","workbook":"xlsx","n_sheets":5,"sheets":["Instructions","Distributions","Data Validation","Counties","Municipalities"],"not_rendered":{"charts":0,"images":0,"macros":1,"external_links":0,"defined_names":23,"comments":0,"pivot_tables":0},"unopened":[],"bounds":{"document_bytes":16777216,"sheet_cells":100000,"rows_first":2000,"rows_last":500,"rows_between":2000,"halvings":0,"cell_chars":16384,"cell_head_chars":4096},"cells_cut":0,"cells_raw":0,"read":"whole","date_system":"1900"}

{"sheet":"Instructions","index":0,"n_rows":30,"n_cols":2,"rows_kept":30,"cut":false,"hidden":false,"merged":[]}
["Prior Round UHAC Distributions Calculator"]
["GENERAL","Notes:"]
[null,"This calculator is to be used only to calculate the affordability averages and bedroom distributions for prior round units. For pricing, please use the \"2025 UHAC Calculator.\""]
[null,"Do NOT cut ANYTHING from or paste ANYTHING into this workbook!"]
[null,"Seriously, any cutting and any pasting could break formulas and is strongly discouraged!"]
[null,"Button commands cannot be undone!"]
[null,"Cells that allow user input are colored light orange like this cell."]
[null,"Cells that due to other entries have no valid inputs are colored dark gray like this cell."]
[null,"Blank cells are treated as zeros."]
[null,"Sections must be completed in order."]
[null,"The 'Project Name', 'Municipality', 'Date', 'Prepared By', and 'File Name' fields are always optional, but included for administrative purposes."]
[null,"Button commands are for ease of use, but are entirely optional."]
[]
["DISTRIBUTIONS CALCULATOR","Instructions:"]
[null,"1. Enter 'Population' in B6, 'Tenure' in B7, and 'Total Restricted Units' in B8. Calculator will not activate unless all three of B6:B8 are filled out."]
[null,"2. Enter bedroom distribution in B19:B24 and income distribution in B32:B34."]
[null,"3. Enter bedrooms + income breakdown in C43:E48."]
[null,"4. Enter affordability levels with unit counts in A75:B85."]
[null,"5. Enter very-low-income bedrooms + affordability breakdown in C115:F120."]
[null,"6. Enter low-income bedrooms + affordability breakdown in C130:F135."]
[null,"7. Enter moderate-income bedrooms + affordability breakdown in C145:F150."]
[null,"8. Refer to summary info in L7:N13 to determine overall UHAC compliance."]
[null,"9. Refer to J19:Q137 to determine compliance with specific UHAC requirements."]
[]
[null,"Notes:"]
[null,"Sections below 'Basic Info' will be treated as inactive if all user input cells are blank."]
[null,"All unit counts must be non-negative whole numbers."]
[null,"Affordability levels must be between 10% and 70%."]
[]
[null,"Disclaimer: This document is a tool to assist with the affordability average and bedroom distribution calculations under the 2004 UHAC regulations, which were effective from December 20, 2004, to December 20, 2024. These materials are for educational, non-commercial, discussion purposes only, and should not be relied on for business, legal, or financial decisions. Any use of these materials and the computations made in these materials for business, legal, and financial advice must be tailored to the specific circumstances of each case. Nothing provided herein should be used as a substitute for the advice of competent professionals. NJHMFA makes no claim, promise, guarantee or representation as to the suitability, reliability, appropriateness or accuracy of the information contained in these materials."]

{"sheet":"Distributions","index":1,"n_rows":175,"n_cols":18,"rows_kept":175,"cut":false,"hidden":false,"merged":[[174,0,174,7],[5,1,5,2],[6,1,6,2],[7,1,7,2],[9,1,9,2],[10,1,10,2],[12,1,12,2],[9,5,9,7],[10,5,10,7],[12,5,12,7],[13,1,13,2],[11,1,11,2]]}
["PRIOR ROUND DISTRIBUTIONS CALCULATOR",null,null,null,null,null,null,null,null,null,"Do NOT cut ANYTHING from or paste ANYTHING into this spreadsheet!",null,null,null,null,null,null,"Municipality Lookup"]
[null,null,null,null,null,null,null,null,null,null,"Cells that allow user input are colored light orange like this cell.",null,null,null,null,null,null,{"$f":"IF($B$11=\"Cape May\", \"Cape_May\", $B$11)","v":0}]
["Calculator Active?",{"$f":"AND(NOT(ISBLANK($B$6)), NOT(ISBLANK($B$7)), $B$8>0)","v":false},null,null,null,null,null,null,null,null,"Cells that due to other entries have no valid inputs are colored dark gray like this cell."]
[]
["BASIC INFO",null,null,null,null,null,null,null,null,null,"DISTRIBUTIONS SUMMARY"]
["Population",null,null,null,null,null,null,null,null,null,"Section","Active?","Data Valid?","Compliant?"]
["Tenure",null,null,null,null,null,null,null,null,null,"Bedroom Distribution",{"$f":"IF($B$17=TRUE,\"Yes\",IF($B$17=FALSE,\"No\", IF($B$17=\"Calculator Inactive\", \"N/A\", \"ERROR\")))","v":"N/A"},{"$f":"IF($B$26=TRUE, \"Yes\", IF($B$26=FALSE, \"No\", IF($B$26=\"Section Inactive\", \"N/A\", \"ERROR\")))","v":"N/A"},{"$f":"IF($P$28=TRUE, \"Yes\", IF($P$28=FALSE, \"No\", IF(OR($P$28=\"\", $B$26=\"Section Inactive\"), \"N/A\", \"ERROR\")))","v":"N/A"}]
["Total Restricted Units",null,null,null,null,null,null,null,null,null,"Income Distribution",{"$f":"IF($B$30=TRUE,\"Yes\",IF($B$30=FALSE,\"No\", IF($B$30=\"Calculator Inactive\", \"N/A\", \"ERROR\")))","v":"N/A"},{"$f":"IF($B$36=TRUE, \"Yes\", IF($B$36=FALSE, \"No\", IF($B$36=\"Section Inactive\", \"N/A\", \"ERROR\")))","v":"N/A"},{"$f":"IF($P$35=TRUE, \"Yes\", IF($P$35=FALSE, \"No\", IF(OR($P$35=\"\", $B$36=\"Section Inactive\"), \"N/A\", \"ERROR\")))","v":"N/A"}]
[null,null,null,null,null,null,null,null,null,null,"Bedrooms + Income",{"$f":"IF($B$39=TRUE,\"Yes\",IF($B$39=FALSE,\"No\", IF($B$39=\"Calculator Inactive\", \"N/A\", \"ERROR\")))","v":"N/A"},{"$f":"IF($B$52=TRUE, \"Yes\", IF($B$52=FALSE, \"No\", IF($B$52=\"Section Inactive\", \"N/A\", \"ERROR\")))","v":"N/A"},{"$f":"IF($P$51=TRUE, \"Yes\", IF($P$51=FALSE, \"No\", IF(OR($P$51=\"\", $B$52=\"Section Inactive\"), \"N/A\", \"ERROR\")))","v":"N/A"}]
["Project Name",null,null,null,"Date",null,null,null,null,null,"Affordability Levels",{"$f":"IF($B$71=TRUE,\"Yes\",IF($B$71=FALSE,\"No\", IF($B$71=\"Calculator Inactive\", \"N/A\", \"ERROR\")))","v":"N/A"},{"$f":"IF($B$89=TRUE, \"Yes\", IF($B$89=FALSE, \"No\", IF($B$89=\"Section Inactive\", \"N/A\", \"ERROR\")))","v":"N/A"},{"$f":"IF($P$88=TRUE, \"Yes\", IF($P$88=FALSE, \"No\", IF(OR($P$88=\"\", $B$89=\"Section Inactive\"), \"N/A\", \"ERROR\")))","v":"N/A"}]
["County",null,null,null,"Prepared By",null,null,null,null,null,"Bedrooms + Affordability",{"$f":"IF($B$110=TRUE,\"Yes\",IF($B$110=FALSE,\"No\", IF($B$110=\"Calculator Inactive\", \"N/A\", \"ERROR\")))","v":"N/A"},{"$f":"IF($B$156=TRUE, \"Yes\", IF($B$156=FALSE, \"No\", IF($B$156=\"Section Inactive\", \"N/A\", \"ERROR\")))","v":"N/A"},{"$f":"IF($P$137=TRUE, \"Yes\", IF($P$137=FALSE, \"No\", IF(OR($P$137=\"\", $B$156=\"Section Inactive\"), \"N/A\", \"ERROR\")))","v":"N/A"}]
["Region",{"$f":"IF(ISBLANK($B$11), \"\", INDEX(counties[Region], MATCH($B$11, counties[County], 0), 1))","v":""},null,null,null,null,null,null,null,null,"Number of Issues",{"$f":"IF($B$3=TRUE, COUNTIF($L$7:$L$11, \"<>\"&\"Yes\"), \"\")","v":""},{"$f":"IF($B$3=TRUE, COUNTIF($M$7:$M$11, \"No\"), \"\")","v":""},{"$f":"IF($B$3=TRUE, COUNTIF($N$7:$N$11, \"No\"), \"\")","v":""}]
["Municipality",null,null,null,"File Name",null,null,null,null,null,"Prior Round UHAC-Compliant?",{"$f":"IF($B$3=TRUE, IF(SUM($L$12:$N$12)=0, \"YES\", \"NO\"), \"\")","v":""}]
["Municipality Code",{"$f":"IF(OR(ISBLANK($B$13), $B$13=\"\"), \"\", IF(ISBLANK($B$11), \"County Missing!\", IFERROR(INDEX(munis[DCA Municode], MATCH(1, (munis[Municipality]=$B$13)*(munis[County]=$B$11), 0), 1), \"ERROR\")))","v":""}]
[]
["BEDROOM DISTRIBUTION"]
["Section Active?",{"$f":"IF($B$3, IF(COUNTA($B$19:$B$24)>0, TRUE, FALSE), \"Calculator Inactive\")","v":"Calculator Inactive"}]
["Bedroom Count","Number of Units","Bedrooms",null,null,null,null,null,null,"Citation","Prior Round UHAC Requirement","Applicable?","Required","Operator","Actual","OK?","Optional?"]
["0BR",null,{"$f":"IF($B$17=TRUE, VALUE(LEFT($A19))*$B19, \"\")","v":""}]
["1BR",null,{"$f":"IF($B$17=TRUE, VALUE(LEFT($A20))*$B20, \"\")","v":""}]
["2BR",null,"",null,null,null,null,null,null,"(b)1","Family: 0BR + 1BR units no more than 20% of total restricted units",{"$f":"IF($B$3, IF($B$6=\"Family\", TRUE, FALSE), \"\")","v":""},{"$f":"IF($L21=TRUE, ROUNDDOWN(0.2*$B$8, 0), \"\")","v":""},">=",{"$f":"IF(AND($L21=TRUE, $B$17=TRUE), SUM($B$19:$B$20), \"\")","v":""},{"$f":"IF(AND($L21=TRUE, $B$17=TRUE), IF($N21=\"=\", $M21=$O21, IF($N21=\"<=\", $M21<=$O21, IF($N21=\">=\", $M21>=$O21, IF($N21=\"N/A\", \"N/A\", \"ERROR\")))), \"\")","v":""}]
["3BR",null,"",null,null,null,null,null,null,"(b)2","Family: 2BR units at least 30% of total restricted units",{"$f":"IF($B$3, IF($B$6=\"Family\", TRUE, FALSE), \"\")","v":""},{"$f":"IF($L22=TRUE, ROUNDUP(0.3*$B$8, 0), \"\")","v":""},"<=",{"$f":"IF(AND($L22=TRUE, $B$17=TRUE), $B$21, \"\")","v":""},""]
["4BR",null,"",null,null,null,null,null,null,"(b)3","Family: 3BR units at least 20% of total restricted units",{"$f":"IF($B$3, IF($B$6=\"Family\", TRUE, FALSE), \"\")","v":""},{"$f":"IF($L23=TRUE, ROUNDUP(0.2*$B$8, 0), \"\")","v":""},"<=",{"$f":"IF(AND($L23=TRUE, $B$17=TRUE), $B$22, \"\")","v":""},""]
["5BR",null,""]
["Column Total",{"$f":"IF($B$17=TRUE, SUM(B$19:B$24), \"\")","v":""},{"$f":"IF($B$17=TRUE, SUM(C$19:C$24), \"\")","v":""},null,null,null,null,null,null,"(c)","Age-restricted: Restricted bedrooms at least 1x total restricted units",{"$f":"IF($B$3, IF($B$6=\"Age-restricted/supportive\", TRUE, FALSE), \"\")","v":""},{"$f":"IF($L25=TRUE, $B$8, \"\")","v":""},"<=",{"$f":"IF(AND($L25=TRUE, $B$17=TRUE), $C$25, \"\")","v":""},""]
["Unit Count Match?",{"$f":"IF($B$17=TRUE, IF($B$8=$B$25, TRUE, FALSE), \"Section Inactive\")","v":"Section Inactive"}]
[]
[null,null,null,null,null,null,null,null,null,null,"OVERALL BEDROOM DISTRIBUTION",{"$f":"IF($B$3, IF(COUNTIFS($L$21:$L$25, TRUE, $Q$21:$Q$25, \"<>\"&\"Yes\")>0, TRUE, FALSE), \"\")","v":""},{"$f":"IF($L28=TRUE, COUNTIFS($L$21:$L$25, TRUE, $Q$21:$Q$25, \"<>\"&\"Yes\"), \"\")","v":""},"=",{"$f":"IF(AND($L28=TRUE, $B$17=TRUE), COUNTIFS($P$21:$P$25, TRUE, $Q$21:$Q$25, \"<>\"&\"Yes\"), \"\")","v":""},""]
["INCOME DISTRIBUTION",null,null,null,null,null,null,null,null,null,"* Pursuant to P.L. 2008, c. 46."]
["Section Active?",{"$f":"IF($B$3, IF(AND($B$17=TRUE), IF(COUNTA($B$32:$B$34)>0, TRUE, FALSE), FALSE), \"Calculator Inactive\")","v":"Calculator Inactive"},null,null,null,null,null,null,null,null,"Calculation for (d)* is advisory."]
["Income Tier","Number of Units",null,null,null,null,null,null,null,"Citation","Prior Round UHAC Requirement","Applicable?","Required","Operator","Actual","OK?","Optional?"]
["Very Low (0%–30% median)",null,null,null,null,null,null,null,null,"(a)","Low + Very Low units at least 50% of total restricted units",{"$f":"IF($B$3, TRUE, \"\")","v":""},{"$f":"IF($L32=TRUE, ROUNDUP(0.5*$B$8, 0), \"\")","v":""},"<=",{"$f":"IF(AND($L32=TRUE, $B$30=TRUE), $B$32+$B$33, \"\")","v":""},{"$f":"IF(AND($L32=TRUE, $B$30=TRUE), IF($N32=\"=\", $M32=$O32, IF($N32=\"<=\", $M32<=$O32, IF($N32=\">=\", $M32>=$O32, IF($N32=\"N/A\", \"N/A\", \"ERROR\")))), \"\")","v":""}]
["Low (>30%–50% median)",null,null,null,null,null,null,null,null,"(d)*","Very Low at least 13% of total restricted units (required for municipality)",{"$f":"IF($B$3, TRUE, \"\")","v":""},{"$f":"IF($L33=TRUE, ROUNDUP(0.13*$B$8, 0), \"\")","v":""},"<=",{"$f":"IF(AND($L33=TRUE, $B$30=TRUE), $B$32, \"\")","v":""},{"$f":"IF(AND($L33=TRUE, $B$30=TRUE), IF($N33=\"=\", $M33=$O33, IF($N33=\"<=\", $M33<=$O33, IF($N33=\">=\", $M33>=$O33, IF($N33=\"N/A\", \"N/A\", \"ERROR\")))), \"\")","v":""},"Yes"]
["Moderate (>50%–80% median)"]
["Column Total",{"$f":"IF($B$30=TRUE, SUM($B$32:$B$34), \"\")","v":""},null,null,null,null,null,null,null,null,"OVERALL INCOME DISTRIBUTION",{"$f":"IF($B$3, IF(COUNTIFS($L$32:$L$33, TRUE, $Q$32:$Q$33, \"<>\"&\"Yes\")>0, TRUE, FALSE), \"\")","v":""},{"$f":"IF($L35=TRUE, COUNTIFS($L$32:$L$33, TRUE, $Q$32:$Q$33, \"<>\"&\"Yes\"), \"\")","v":""},"=",{"$f":"IF(AND($L35=TRUE, $B$30=TRUE), COUNTIFS($P$32:$P$33, TRUE, $Q$32:$Q$33, \"<>\"&\"Yes\"), \"\")","v":""},{"$f":"IF(AND($L35=TRUE, $B$30=TRUE), IF($N35=\"=\", $M35=$O35, IF($N35=\"<=\", $M35<=$O35, IF($N35=\">=\", $M35>=$O35, IF($N35=\"N/A\", \"N/A\", \"ERROR\")))), \"\")","v":""}]
["Unit Count Match?",{"$f":"IF($B$30=TRUE, IF($B$8=$B$35, TRUE, FALSE), \"Section Inactive\")","v":"Section Inactive"}]
[]
["BEDROOMS + INCOME",null,null,null,null,null,null,null,null,null,"Table disallows values greater than the row/column total."]
["Section Active?",{"$f":"IF($B$3, IF(AND($B$17=TRUE, $B$30=TRUE), IF(COUNTA($C$43:$E$48)>0, TRUE, FALSE), FALSE), \"Calculator Inactive\")","v":"Calculator Inactive"}]
["Income Tiers","All Restricted Units","Very Low","Low","Moderate",null,null,null,null,null,"** From 2025 UHAC."]
{"$rows_left_out":136}
{"sheet":"Data Validation","index":2,"n_rows":8,"n_cols":14,"rows_kept":8,"cut":false,"hidden":true,"merged":[]}
["Quick Population",null,"Population",null,"Tenure",null,"Structure Type",null,"Unit Size","Bedroom Count",null,"Income Restriction",null,"Y/N"]
["Family",null,"Family",null,"For-sale",null,"High rise with elevator",null,"Studio/eff.",0,null,"Very-low income (30% RMI)",null,"Yes"]
["Age-restricted/supportive",null,"Age-restricted",null,"Rental",null,"Low-rise",null,"1BR",1,null,"Low income (50% RMI)",null,"No"]
[null,null,"Supportive housing",null,null,null,"Manufactured home",null,"2BR",2,null,"Moderate income (80% RMI)"]
[null,null,null,null,null,null,"Rowhouse/townhouse",null,"3BR",3,null,"None (market-rate)"]
[null,null,null,null,null,null,"Semi-detached",null,"4BR",4]
[null,null,null,null,null,null,"Single family detached",null,"5BR",5]
[null,null,null,null,null,null,null,null,"6BR",6]

{"sheet":"Counties","index":3,"n_rows":22,"n_cols":3,"rows_kept":22,"cut":false,"hidden":true,"merged":[]}
["County","Region","Region Name"]
["Atlantic",6,"South-Southwest"]
["Bergen",1,"Northeast"]
["Burlington",5,"Southwest"]
["Camden",5,"Southwest"]
["Cape May",6,"South-Southwest"]
["Cumberland",6,"South-Southwest"]
["Essex",2,"Northwest"]
["Gloucester",5,"Southwest"]
["Hudson",1,"Northeast"]
["Hunterdon",3,"West Central"]
["Mercer",4,"East Central"]
["Middlesex",3,"West Central"]
["Monmouth",4,"East Central"]
["Morris",2,"Northwest"]
["Ocean",4,"East Central"]
["Passaic",1,"Northeast"]
["Salem",6,"South-Southwest"]
["Somerset",3,"West Central"]
["Sussex",1,"Northeast"]
["Union",2,"Northwest"]
["Warren",2,"Northwest"]

{"sheet":"Municipalities","index":4,"n_rows":565,"n_cols":17,"rows_kept":565,"cut":false,"hidden":true,"merged":[]}
["County Subdivision FIPS Code","DCA Municode","Municipality","County","Region","Present Need","Qualified Urban Aid Municipality","Equalized Nonresidential Valuation Factor","Land Capacity Factor","Income Capacity Factor","Average Allocation Factor","Prospective Need","Prospective Need >1,000?","Total Households (2020 Census)","Subject to 1,000/20% Cap? (PN>1,000 or PN>20% of Occ. Hsg)","Cap","Prospective Need Obligation with 1,000/20% Cap"]
[3400100100,"0101","Absecon city","Atlantic",6,39,0,9.6544336444310229E-3,1.1143708153858104E-2,1.4401505167369088E-2,1.1733215655219405E-2,22,0,3614,0,723,22]
[3400102080,"0102","Atlantic City","Atlantic",6,875,1,0,0,0,0,0,0,15859,0,1000,0]
[3400107810,"0103","Brigantine city","Atlantic",6,13,0,9.7558871646873241E-3,0,2.1035177597171415E-2,1.0263688253952912E-2,19,0,3798,0,760,19]
[3400108680,"0104","Buena borough","Atlantic",6,3,0,1.2347653209132383E-3,4.5145301093290328E-4,1.2565415128675941E-2,4.7505444868406943E-3,9,0,1766,0,353,9]
[3400108710,"0105","Buena Vista township","Atlantic",6,22,0,7.353648192267242E-3,5.3278613880365254E-4,1.3536534504933818E-2,7.1409896120015704E-3,13,0,2750,0,550,13]
[3400115160,"0106","Corbin City","Atlantic",6,0,0,5.8824216259497838E-4,0,8.3695983815199812E-3,2.9859468480383199E-3,6,0,187,0,37,6]
[3400120290,"0108","Egg Harbor township","Atlantic",6,164,0,9.1879546097405243E-2,7.7664056082073704E-2,6.4887854670463055E-2,7.8143818949980667E-2,148,0,17065,0,1000,148]
[3400120350,"0107","Egg Harbor City","Atlantic",6,61,0,3.9740394898468033E-3,5.1074476489045622E-3,5.2720313752954674E-3,4.7845061713489437E-3,9,0,1712,0,342,9]
[3400121870,"0109","Estell Manor city","Atlantic",6,0,0,6.503100575965461E-4,0,1.4548636076064152E-2,5.0663153778868998E-3,10,0,631,0,126,10]
[3400123940,"0110","Folsom borough","Atlantic",6,0,0,3.4385212941542066E-3,0,1.4550842393259057E-2,5.996454562471088E-3,11,0,671,0,134,11]
[3400125560,"0111","Galloway township","Atlantic",6,260,0,4.6718067415615717E-2,4.4966592848251649E-2,4.9594378901642318E-2,4.7093013055169893E-2,89,0,13679,0,1000,89]
[3400129280,"0112","Hamilton township","Atlantic",6,13,0,3.0361298743954955E-2,3.2254229471750703E-2,4.0469192999914159E-2,3.4361573738539937E-2,65,0,10462,0,1000,65]
[3400129430,"0113","Hammonton town","Atlantic",6,64,0,2.7313964612758306E-2,2.7986054165471803E-2,2.2466485104893557E-2,2.5922167961041225E-2,49,0,5456,0,1000,49]
[3400140530,"0114","Linwood city","Atlantic",6,49,0,9.0769591552553562E-3,1.0856166200131653E-3,2.9352918824862136E-2,1.3171831533376886E-2,25,0,2643,0,529,25]
[3400141370,"0115","Longport borough","Atlantic",6,0,0,-1.8113470721460031E-4,0,1.1712225324683776E-2,3.8436968724897252E-3,7,0,452,0,90,7]
[3400143890,"0116","Margate City","Atlantic",6,19,0,1.0837134162448152E-2,0,2.3145583111511256E-2,1.1327572424653135E-2,21,0,2651,0,530,21]
[3400149410,"0117","Mullica township","Atlantic",6,0,0,2.3773280663161125E-3,3.6867855695497261E-3,1.4826641090391352E-2,6.9635849087523972E-3,13,0,2196,0,439,13]
[3400152950,"0118","Northfield city","Atlantic",6,10,0,1.3346942295884085E-2,1.6391782233695028E-3,2.3014545299297542E-2,1.266688860618371E-2,24,0,3116,0,623,24]
[3400159640,"0119","Pleasantville city","Atlantic",6,294,1,0,0,0,0,0,0,7252,0,1000,0]
[3400160600,"0120","Port Republic city","Atlantic",6,10,0,4.6786562103177725E-4,0,1.6181722497982855E-2,5.5498627063382102E-3,10,0,409,0,82,10]
[3400168430,"0121","Somers Point city","Atlantic",6,27,0,3.379551019292483E-2,5.4389900717215884E-4,1.503041016922305E-2,1.6456606456440013E-2,31,0,4844,0,969,31]
[3400175620,"0122","Ventnor City","Atlantic",6,24,0,6.9176669452499524E-3,0,1.5548872752517564E-2,7.4888465659225063E-3,14,0,4296,0,859,14]
[3400180330,"0123","Weymouth township","Atlantic",6,0,0,3.7018195796355456E-3,0,7.7223952736924263E-3,3.8080716177759911E-3,7,0,1207,0,241,7]
[3400300700,"0201","Allendale borough","Bergen",1,159,0,5.5508777545351445E-3,1.2057056296230877E-2,1.0497779645771576E-2,9.3685712321791986E-3,260,0,2327,0,465,260]
[3400301090,"0202","Alpine borough","Bergen",1,0,0,1.7461957358245515E-3,1.4135050743536891E-2,1.1902314702182677E-2,9.2611870605147067E-3,257,0,587,1,117,117]
[3400305170,"0203","Bergenfield borough","Bergen",1,137,1,0,0,0,0,0,0,9097,0,1000,0]
[3400306490,"0204","Bogota borough","Bergen",1,26,0,2.2873918759205281E-3,6.226479468134467E-4,6.5995389704103409E-3,3.1698595977147719E-3,88,0,2939,0,588,88]
[3400310480,"0205","Carlstadt borough","Bergen",1,0,0,5.144577064325493E-2,8.6451595595478579E-5,3.7127758917642898E-3,1.8414999376871567E-2,511,0,2429,1,486,486]
[3400313570,"0206","Cliffside Park borough","Bergen",1,150,1,0,0,0,0,0,0,10735,0,1000,0]
[3400313810,"0207","Closter borough","Bergen",1,16,0,8.3898645502371652E-3,5.7440041898492713E-3,1.3038939314940632E-2,9.0576026850090231E-3,251,0,2762,0,552,251]
[3400315820,"0208","Cresskill borough","Bergen",1,0,0,3.9967811906845511E-3,1.0501668380557153E-3,1.1666201364313782E-2,5.5710497976846829E-3,155,0,3015,0,603,155]
[3400317530,"0209","Demarest borough","Bergen",1,0,0,3.2278195494441988E-4,1.4845462617563792E-3,9.6308858618857039E-3,3.8127380261955006E-3,106,0,1598,0,320,106]
[3400318400,"0210","Dumont borough","Bergen",1,16,0,2.9684124360818019E-3,6.0271357577090312E-4,1.0257996491538152E-2,4.6097075011302859E-3,128,0,6408,0,1000,128]
[3400319510,"0212","East Rutherford borough","Bergen",1,53,0,3.2673514093486317E-2,6.8723865998461253E-3,5.0097825212063333E-3,1.4851894404846258E-2,412,0,4306,0,861,412]
[3400320020,"0213","Edgewater borough","Bergen",1,6,0,1.7746166417928651E-2,1.5327764213168442E-4,1.3990739287790946E-2,1.0630061115950426E-2,295,0,6742,0,1000,295]
[3400321300,"0211","Elmwood Park borough","Bergen",1,154,0,7.6333818773040036E-3,2.5485457244890544E-3,5.4708988402400295E-3,5.2176088140110299E-3,145,0,7652,0,1000,145]
[3400321450,"0214","Emerson borough","Bergen",1,0,0,3.6822453565632713E-3,7.0274285331049981E-3,8.9143483709943887E-3,6.5413407535542187E-3,181,0,2482,0,496,181]
[3400321480,"0215","Englewood city","Bergen",1,166,0,2.5330986721263476E-2,6.4501074757113523E-3,9.4298946690358904E-3,1.373699628867024E-2,381,0,10909,0,1000,381]
[3400321510,"0216","Englewood Cliffs borough","Bergen",1,0,0,1.7840424649196388E-2,3.5624271217070264E-3,1.4139660411509738E-2,1.1847504060804384E-2,329,0,1846,0,369,329]
{"$rows_left_out":525}