{"text_format":"1","workbook":"xlsx","n_sheets":5,"sheets":["Instructions","Distributions","Data Validation","Counties","Municipalities"],"not_rendered":{"charts":0,"images":0,"macros":1,"external_links":0,"defined_names":23,"comments":0,"pivot_tables":0},"unopened":[],"bounds":{"document_bytes":16777216,"sheet_cells":100000,"rows_first":2000,"rows_last":500,"rows_between":2000,"halvings":0,"cell_chars":16384,"cell_head_chars":4096},"cells_cut":0,"cells_raw":0,"read":"whole","date_system":"1900"}

{"sheet":"Instructions","index":0,"n_rows":30,"n_cols":2,"rows_kept":30,"cut":false,"hidden":false,"merged":[]}
["Prior Round UHAC Distributions Calculator"]
["GENERAL","Notes:"]
[null,"This calculator is to be used only to calculate the affordability averages and bedroom distributions for prior round units. For pricing, please use the \"2025 UHAC Calculator.\""]
[null,"Do NOT cut ANYTHING from or paste ANYTHING into this workbook!"]
[null,"Seriously, any cutting and any pasting could break formulas and is strongly discouraged!"]
[null,"Button commands cannot be undone!"]
[null,"Cells that allow user input are colored light orange like this cell."]
[null,"Cells that due to other entries have no valid inputs are colored dark gray like this cell."]
[null,"Blank cells are treated as zeros."]
[null,"Sections must be completed in order."]
[null,"The 'Project Name', 'Municipality', 'Date', 'Prepared By', and 'File Name' fields are always optional, but included for administrative purposes."]
[null,"Button commands are for ease of use, but are entirely optional."]
[]
["DISTRIBUTIONS CALCULATOR","Instructions:"]
[null,"1. Enter 'Population' in B6, 'Tenure' in B7, and 'Total Restricted Units' in B8. Calculator will not activate unless all three of B6:B8 are filled out."]
[null,"2. Enter bedroom distribution in B19:B24 and income distribution in B32:B34."]
[null,"3. Enter bedrooms + income breakdown in C43:E48."]
[null,"4. Enter affordability levels with unit counts in A75:B85."]
[null,"5. Enter very-low-income bedrooms + affordability breakdown in C115:F120."]
[null,"6. Enter low-income bedrooms + affordability breakdown in C130:F135."]
[null,"7. Enter moderate-income bedrooms + affordability breakdown in C145:F150."]
[null,"8. Refer to summary info in L7:N13 to determine overall UHAC compliance."]
[null,"9. Refer to J19:Q137 to determine compliance with specific UHAC requirements."]
[]
[null,"Notes:"]
[null,"Sections below 'Basic Info' will be treated as inactive if all user input cells are blank."]
[null,"All unit counts must be non-negative whole numbers."]
[null,"Affordability levels must be between 10% and 70%."]
[]
[null,"Disclaimer: This document is a tool to assist with the affordability average and bedroom distribution calculations under the 2004 UHAC regulations, which were effective from December 20, 2004, to December 20, 2024. These materials are for educational, non-commercial, discussion purposes only, and should not be relied on for business, legal, or financial decisions. Any use of these materials and the computations made in these materials for business, legal, and financial advice must be tailored to the specific circumstances of each case. Nothing provided herein should be used as a substitute for the advice of competent professionals. NJHMFA makes no claim, promise, guarantee or representation as to the suitability, reliability, appropriateness or accuracy of the information contained in these materials."]

{"sheet":"Distributions","index":1,"n_rows":175,"n_cols":18,"rows_kept":175,"cut":false,"hidden":false,"merged":[[174,0,174,7],[5,1,5,2],[6,1,6,2],[7,1,7,2],[9,1,9,2],[10,1,10,2],[12,1,12,2],[9,5,9,7],[10,5,10,7],[12,5,12,7],[13,1,13,2],[11,1,11,2]]}
["PRIOR ROUND DISTRIBUTIONS CALCULATOR",null,null,null,null,null,null,null,null,null,"Do NOT cut ANYTHING from or paste ANYTHING into this spreadsheet!",null,null,null,null,null,null,"Municipality Lookup"]
[null,null,null,null,null,null,null,null,null,null,"Cells that allow user input are colored light orange like this cell.",null,null,null,null,null,null,{"$f":"IF($B$11=\"Cape May\", \"Cape_May\", $B$11)","v":0}]
["Calculator Active?",{"$f":"AND(NOT(ISBLANK($B$6)), NOT(ISBLANK($B$7)), $B$8>0)","v":false},null,null,null,null,null,null,null,null,"Cells that due to other entries have no valid inputs are colored dark gray like this cell."]
[]
["BASIC INFO",null,null,null,null,null,null,null,null,null,"DISTRIBUTIONS SUMMARY"]
["Population",null,null,null,null,null,null,null,null,null,"Section","Active?","Data Valid?","Compliant?"]
["Tenure",null,null,null,null,null,null,null,null,null,"Bedroom Distribution",{"$f":"IF($B$17=TRUE,\"Yes\",IF($B$17=FALSE,\"No\", IF($B$17=\"Calculator Inactive\", \"N/A\", \"ERROR\")))","v":"N/A"},{"$f":"IF($B$26=TRUE, \"Yes\", IF($B$26=FALSE, \"No\", IF($B$26=\"Section Inactive\", \"N/A\", \"ERROR\")))","v":"N/A"},{"$f":"IF($P$28=TRUE, \"Yes\", IF($P$28=FALSE, \"No\", IF(OR($P$28=\"\", $B$26=\"Section Inactive\"), \"N/A\", \"ERROR\")))","v":"N/A"}]
["Total Restricted Units",null,null,null,null,null,null,null,null,null,"Income Distribution",{"$f":"IF($B$30=TRUE,\"Yes\",IF($B$30=FALSE,\"No\", IF($B$30=\"Calculator Inactive\", \"N/A\", \"ERROR\")))","v":"N/A"},{"$f":"IF($B$36=TRUE, \"Yes\", IF($B$36=FALSE, \"No\", IF($B$36=\"Section Inactive\", \"N/A\", \"ERROR\")))","v":"N/A"},{"$f":"IF($P$35=TRUE, \"Yes\", IF($P$35=FALSE, \"No\", IF(OR($P$35=\"\", $B$36=\"Section Inactive\"), \"N/A\", \"ERROR\")))","v":"N/A"}]
[null,null,null,null,null,null,null,null,null,null,"Bedrooms + Income",{"$f":"IF($B$39=TRUE,\"Yes\",IF($B$39=FALSE,\"No\", IF($B$39=\"Calculator Inactive\", \"N/A\", \"ERROR\")))","v":"N/A"},{"$f":"IF($B$52=TRUE, \"Yes\", IF($B$52=FALSE, \"No\", IF($B$52=\"Section Inactive\", \"N/A\", \"ERROR\")))","v":"N/A"},{"$f":"IF($P$51=TRUE, \"Yes\", IF($P$51=FALSE, \"No\", IF(OR($P$51=\"\", $B$52=\"Section Inactive\"), \"N/A\", \"ERROR\")))","v":"N/A"}]
["Project Name",null,null,null,"Date",null,null,null,null,null,"Affordability Levels",{"$f":"IF($B$71=TRUE,\"Yes\",IF($B$71=FALSE,\"No\", IF($B$71=\"Calculator Inactive\", \"N/A\", \"ERROR\")))","v":"N/A"},{"$f":"IF($B$89=TRUE, \"Yes\", IF($B$89=FALSE, \"No\", IF($B$89=\"Section Inactive\", \"N/A\", \"ERROR\")))","v":"N/A"},{"$f":"IF($P$88=TRUE, \"Yes\", IF($P$88=FALSE, \"No\", IF(OR($P$88=\"\", $B$89=\"Section Inactive\"), \"N/A\", \"ERROR\")))","v":"N/A"}]
["County",null,null,null,"Prepared By",null,null,null,null,null,"Bedrooms + Affordability",{"$f":"IF($B$110=TRUE,\"Yes\",IF($B$110=FALSE,\"No\", IF($B$110=\"Calculator Inactive\", \"N/A\", \"ERROR\")))","v":"N/A"},{"$f":"IF($B$156=TRUE, \"Yes\", IF($B$156=FALSE, \"No\", IF($B$156=\"Section Inactive\", \"N/A\", \"ERROR\")))","v":"N/A"},{"$f":"IF($P$137=TRUE, \"Yes\", IF($P$137=FALSE, \"No\", IF(OR($P$137=\"\", $B$156=\"Section Inactive\"), \"N/A\", \"ERROR\")))","v":"N/A"}]
["Region",{"$f":"IF(ISBLANK($B$11), \"\", INDEX(counties[Region], MATCH($B$11, counties[County], 0), 1))","v":""},null,null,null,null,null,null,null,null,"Number of Issues",{"$f":"IF($B$3=TRUE, COUNTIF($L$7:$L$11, \"<>\"&\"Yes\"), \"\")","v":""},{"$f":"IF($B$3=TRUE, COUNTIF($M$7:$M$11, \"No\"), \"\")","v":""},{"$f":"IF($B$3=TRUE, COUNTIF($N$7:$N$11, \"No\"), \"\")","v":""}]
["Municipality",null,null,null,"File Name",null,null,null,null,null,"Prior Round UHAC-Compliant?",{"$f":"IF($B$3=TRUE, IF(SUM($L$12:$N$12)=0, \"YES\", \"NO\"), \"\")","v":""}]
["Municipality Code",{"$f":"IF(OR(ISBLANK($B$13), $B$13=\"\"), \"\", IF(ISBLANK($B$11), \"County Missing!\", IFERROR(INDEX(munis[DCA Municode], MATCH(1, (munis[Municipality]=$B$13)*(munis[County]=$B$11), 0), 1), \"ERROR\")))","v":""}]
[]
["BEDROOM DISTRIBUTION"]
["Section Active?",{"$f":"IF($B$3, IF(COUNTA($B$19:$B$24)>0, TRUE, FALSE), \"Calculator Inactive\")","v":"Calculator Inactive"}]
["Bedroom Count","Number of Units","Bedrooms",null,null,null,null,null,null,"Citation","Prior Round UHAC Requirement","Applicable?","Required","Operator","Actual","OK?","Optional?"]
["0BR",null,{"$f":"IF($B$17=TRUE, VALUE(LEFT($A19))*$B19, \"\")","v":""}]
["1BR",null,{"$f":"IF($B$17=TRUE, VALUE(LEFT($A20))*$B20, \"\")","v":""}]
["2BR",null,"",null,null,null,null,null,null,"(b)1","Family: 0BR + 1BR units no more than 20% of total restricted units",{"$f":"IF($B$3, IF($B$6=\"Family\", TRUE, FALSE), \"\")","v":""},{"$f":"IF($L21=TRUE, ROUNDDOWN(0.2*$B$8, 0), \"\")","v":""},">=",{"$f":"IF(AND($L21=TRUE, $B$17=TRUE), SUM($B$19:$B$20), \"\")","v":""},{"$f":"IF(AND($L21=TRUE, $B$17=TRUE), IF($N21=\"=\", $M21=$O21, IF($N21=\"<=\", $M21<=$O21, IF($N21=\">=\", $M21>=$O21, IF($N21=\"N/A\", \"N/A\", \"ERROR\")))), \"\")","v":""}]
["3BR",null,"",null,null,null,null,null,null,"(b)2","Family: 2BR units at least 30% of total restricted units",{"$f":"IF($B$3, IF($B$6=\"Family\", TRUE, FALSE), \"\")","v":""},{"$f":"IF($L22=TRUE, ROUNDUP(0.3*$B$8, 0), \"\")","v":""},"<=",{"$f":"IF(AND($L22=TRUE, $B$17=TRUE), $B$21, \"\")","v":""},""]
["4BR",null,"",null,null,null,null,null,null,"(b)3","Family: 3BR units at least 20% of total restricted units",{"$f":"IF($B$3, IF($B$6=\"Family\", TRUE, FALSE), \"\")","v":""},{"$f":"IF($L23=TRUE, ROUNDUP(0.2*$B$8, 0), \"\")","v":""},"<=",{"$f":"IF(AND($L23=TRUE, $B$17=TRUE), $B$22, \"\")","v":""},""]
["5BR",null,""]
["Column Total",{"$f":"IF($B$17=TRUE, SUM(B$19:B$24), \"\")","v":""},{"$f":"IF($B$17=TRUE, SUM(C$19:C$24), \"\")","v":""},null,null,null,null,null,null,"(c)","Age-restricted: Restricted bedrooms at least 1x total restricted units",{"$f":"IF($B$3, IF($B$6=\"Age-restricted/supportive\", TRUE, FALSE), \"\")","v":""},{"$f":"IF($L25=TRUE, $B$8, \"\")","v":""},"<=",{"$f":"IF(AND($L25=TRUE, $B$17=TRUE), $C$25, \"\")","v":""},""]
["Unit Count Match?",{"$f":"IF($B$17=TRUE, IF($B$8=$B$25, TRUE, FALSE), \"Section Inactive\")","v":"Section Inactive"}]
[]
[null,null,null,null,null,null,null,null,null,null,"OVERALL BEDROOM DISTRIBUTION",{"$f":"IF($B$3, IF(COUNTIFS($L$21:$L$25, TRUE, $Q$21:$Q$25, \"<>\"&\"Yes\")>0, TRUE, FALSE), \"\")","v":""},{"$f":"IF($L28=TRUE, COUNTIFS($L$21:$L$25, TRUE, $Q$21:$Q$25, \"<>\"&\"Yes\"), \"\")","v":""},"=",{"$f":"IF(AND($L28=TRUE, $B$17=TRUE), COUNTIFS($P$21:$P$25, TRUE, $Q$21:$Q$25, \"<>\"&\"Yes\"), \"\")","v":""},""]
["INCOME DISTRIBUTION",null,null,null,null,null,null,null,null,null,"* Pursuant to P.L. 2008, c. 46."]
["Section Active?",{"$f":"IF($B$3, IF(AND($B$17=TRUE), IF(COUNTA($B$32:$B$34)>0, TRUE, FALSE), FALSE), \"Calculator Inactive\")","v":"Calculator Inactive"},null,null,null,null,null,null,null,null,"Calculation for (d)* is advisory."]
["Income Tier","Number of Units",null,null,null,null,null,null,null,"Citation","Prior Round UHAC Requirement","Applicable?","Required","Operator","Actual","OK?","Optional?"]
["Very Low (0%–30% median)",null,null,null,null,null,null,null,null,"(a)","Low + Very Low units at least 50% of total restricted units",{"$f":"IF($B$3, TRUE, \"\")","v":""},{"$f":"IF($L32=TRUE, ROUNDUP(0.5*$B$8, 0), \"\")","v":""},"<=",{"$f":"IF(AND($L32=TRUE, $B$30=TRUE), $B$32+$B$33, \"\")","v":""},{"$f":"IF(AND($L32=TRUE, $B$30=TRUE), IF($N32=\"=\", $M32=$O32, IF($N32=\"<=\", $M32<=$O32, IF($N32=\">=\", $M32>=$O32, IF($N32=\"N/A\", \"N/A\", \"ERROR\")))), \"\")","v":""}]
["Low (>30%–50% median)",null,null,null,null,null,null,null,null,"(d)*","Very Low at least 13% of total restricted units (required for municipality)",{"$f":"IF($B$3, TRUE, \"\")","v":""},{"$f":"IF($L33=TRUE, ROUNDUP(0.13*$B$8, 0), \"\")","v":""},"<=",{"$f":"IF(AND($L33=TRUE, $B$30=TRUE), $B$32, \"\")","v":""},{"$f":"IF(AND($L33=TRUE, $B$30=TRUE), IF($N33=\"=\", $M33=$O33, IF($N33=\"<=\", $M33<=$O33, IF($N33=\">=\", $M33>=$O33, IF($N33=\"N/A\", \"N/A\", \"ERROR\")))), \"\")","v":""},"Yes"]
["Moderate (>50%–80% median)"]
["Column Total",{"$f":"IF($B$30=TRUE, SUM($B$32:$B$34), \"\")","v":""},null,null,null,null,null,null,null,null,"OVERALL INCOME DISTRIBUTION",{"$f":"IF($B$3, IF(COUNTIFS($L$32:$L$33, TRUE, $Q$32:$Q$33, \"<>\"&\"Yes\")>0, TRUE, FALSE), \"\")","v":""},{"$f":"IF($L35=TRUE, COUNTIFS($L$32:$L$33, TRUE, $Q$32:$Q$33, \"<>\"&\"Yes\"), \"\")","v":""},"=",{"$f":"IF(AND($L35=TRUE, $B$30=TRUE), COUNTIFS($P$32:$P$33, TRUE, $Q$32:$Q$33, \"<>\"&\"Yes\"), \"\")","v":""},{"$f":"IF(AND($L35=TRUE, $B$30=TRUE), IF($N35=\"=\", $M35=$O35, IF($N35=\"<=\", $M35<=$O35, IF($N35=\">=\", $M35>=$O35, IF($N35=\"N/A\", \"N/A\", \"ERROR\")))), \"\")","v":""}]
["Unit Count Match?",{"$f":"IF($B$30=TRUE, IF($B$8=$B$35, TRUE, FALSE), \"Section Inactive\")","v":"Section Inactive"}]
[]
["BEDROOMS + INCOME",null,null,null,null,null,null,null,null,null,"Table disallows values greater than the row/column total."]
["Section Active?",{"$f":"IF($B$3, IF(AND($B$17=TRUE, $B$30=TRUE), IF(COUNTA($C$43:$E$48)>0, TRUE, FALSE), FALSE), \"Calculator Inactive\")","v":"Calculator Inactive"}]
["Income Tiers","All Restricted Units","Very Low","Low","Moderate",null,null,null,null,null,"** From 2025 UHAC."]
["Unit Counts",{"$f":"IF($B$30=TRUE, $B$8, \"\")","v":""},{"$f":"IF($B$30=TRUE, $B$32, \"\")","v":""},{"$f":"IF($B$30=TRUE, $B$33, \"\")","v":""},{"$f":"IF($B$30=TRUE, $B$34, \"\")","v":""},null,null,null,null,null,"Advisory statistical estimates for (d)** will not work unless unit counts match."]
["Bedroom Count","Bedroom Count Total","Very Low","Low","Moderate","Row Total","Diff.",null,null,"Citation","Prior Round UHAC Requirement","Applicable?","Required","Operator","Actual","OK?","Optional?"]
["0BR",{"$f":"IF($B$30=TRUE, $B19, \"\")","v":""},null,null,null,{"$f":"IF($B$39=TRUE, SUM($C43:$E43), \"\")","v":""},{"$f":"IF($B$39=TRUE, $F43-$B43, \"\")","v":""},null,null,"(a)","Low + Very Low units at least 50% of 0BR + 1BR units",{"$f":"IF(AND($B$3, $B$26=TRUE, $B$36=TRUE), TRUE, \"\")","v":""},{"$f":"IF($L43=TRUE, ROUNDUP(0.5*($B$43+$B$44), 0), \"\")","v":""},"<=",{"$f":"IF(AND($L43=TRUE, $B$39=TRUE), $C$43+$D$43+$C$44+$D$44, \"\")","v":""},{"$f":"IF(AND($L43=TRUE, $B$39=TRUE), IF($N43=\"=\", $M43=$O43, IF($N43=\"<=\", $M43<=$O43, IF($N43=\">=\", $M43>=$O43, IF($N43=\"N/A\", \"N/A\", \"ERROR\")))), \"\")","v":""}]
["1BR","",null,null,null,"","",null,null,"(a)","Low + Very Low units at least 50% of 2BR units",{"$f":"IF(AND($B$3, $B$26=TRUE, $B$36=TRUE), TRUE, \"\")","v":""},{"$f":"IF($L44=TRUE, ROUNDUP(0.5*$B$45, 0), \"\")","v":""},"<=",{"$f":"IF(AND($L44=TRUE, $B$39=TRUE), $C$45+$D$45, \"\")","v":""},{"$f":"IF(AND($L44=TRUE, $B$39=TRUE), IF($N44=\"=\", $M44=$O44, IF($N44=\"<=\", $M44<=$O44, IF($N44=\">=\", $M44>=$O44, IF($N44=\"N/A\", \"N/A\", \"ERROR\")))), \"\")","v":""}]
["2BR","",null,null,null,"","",null,null,"(a)","Low + Very Low units at least 50% of 3BR units",{"$f":"IF(AND($B$3, $B$26=TRUE, $B$36=TRUE), TRUE, \"\")","v":""},{"$f":"IF($L45=TRUE, ROUNDUP(0.5*$B$46, 0), \"\")","v":""},"<=",{"$f":"IF(AND($L45=TRUE, $B$39=TRUE), $C$46+$D$46, \"\")","v":""},{"$f":"IF(AND($L45=TRUE, $B$39=TRUE), IF($N45=\"=\", $M45=$O45, IF($N45=\"<=\", $M45<=$O45, IF($N45=\">=\", $M45>=$O45, IF($N45=\"N/A\", \"N/A\", \"ERROR\")))), \"\")","v":""}]
["3BR","",null,null,null,"","",null,null,"(a)","Low + Very Low units at least 50% of 4BR and over units",{"$f":"IF(AND($B$3, $B$26=TRUE, $B$36=TRUE), TRUE, \"\")","v":""},{"$f":"IF($L46=TRUE, ROUNDUP(0.5*($B$47+$B$48), 0), \"\")","v":""},"<=",{"$f":"IF(AND($L46=TRUE, $B$39=TRUE), $C$47+$D$47+$C$48+$D$48, \"\")","v":""},{"$f":"IF(AND($L46=TRUE, $B$39=TRUE), IF($N46=\"=\", $M46=$O46, IF($N46=\"<=\", $M46<=$O46, IF($N46=\">=\", $M46>=$O46, IF($N46=\"N/A\", \"N/A\", \"ERROR\")))), \"\")","v":""}]
["4BR","",null,null,null,"","",null,null,"(d)**","Very Low proportional across each bedroom count (0BR/1BR; 2BR; 3BR; 4BR+)"]
["5BR","",null,null,null,"","",null,null,null,"Dissimilarity Index (0–30 = Low; >30–60 = Moderate; >60–100 = High)",{"$f":"IF(AND($B$3, $B$26=TRUE, $B$36=TRUE), TRUE, \"\")","v":""},null,null,{"$f":"IF(AND($L48=TRUE, $B$39=TRUE), IFERROR(100*$D$60, \"ERROR\"), \"\")","v":""},null,"Yes"]
["Column Total",{"$f":"IF($B$39=TRUE, SUM(B$43:B$48), \"\")","v":""},{"$f":"IF($B$39=TRUE, SUM(C$43:C$48), \"\")","v":""},{"$f":"IF($B$39=TRUE, SUM(D$43:D$48), \"\")","v":""},{"$f":"IF($B$39=TRUE, SUM(E$43:E$48), \"\")","v":""},null,null,null,null,null,"Entropy Index (0–100, lower value indicates lower concentration)",{"$f":"IF(AND($B$3, $B$26=TRUE, $B$36=TRUE), TRUE, \"\")","v":""},null,null,{"$f":"IF(AND($L49=TRUE, $B$39=TRUE), IFERROR(100*$E$68, \"ERROR\"), \"\")","v":""},null,"Yes"]
["Difference",{"$f":"IF($B$39=TRUE, B$49-B$41, \"\")","v":""},{"$f":"IF($B$39=TRUE, C$49-C$41, \"\")","v":""},{"$f":"IF($B$39=TRUE, D$49-D$41, \"\")","v":""},{"$f":"IF($B$39=TRUE, E$49-E$41, \"\")","v":""}]
["Row/Column Mismatches",{"$f":"IF($B$39=TRUE, COUNTIF($B$50:$E$50, \"<>\"&0)+COUNTIF($G$43:$G$48, \"<>\"&0), \"\")","v":""},null,null,null,null,null,null,null,null,"OVERALL BEDROOMS + INCOME",{"$f":"IF(AND($B$3, $B$26=TRUE, $B$36=TRUE), IF(COUNTIFS($L$43:$L$49, TRUE, $Q$43:$Q$49, \"<>\"&\"Yes\")>0, TRUE, FALSE), \"\")","v":""},{"$f":"IF($L51=TRUE, COUNTIFS($L$43:$L$49, TRUE, $Q$43:$Q$49, \"<>\"&\"Yes\"), \"\")","v":""},"=",{"$f":"IF(AND($L51=TRUE, $B$39=TRUE), COUNTIFS($P$43:$P$49, TRUE, $Q$43:$Q$49, \"<>\"&\"Yes\"), \"\")","v":""},{"$f":"IF(AND($L51=TRUE, $B$39=TRUE), IF($N51=\"=\", $M51=$O51, IF($N51=\"<=\", $M51<=$O51, IF($N51=\">=\", $M51>=$O51, IF($N51=\"N/A\", \"N/A\", \"ERROR\")))), \"\")","v":""}]
["Unit Counts Valid?",{"$f":"IF($B$39=TRUE, IF($B$51=0, TRUE, FALSE), \"Section Inactive\")","v":"Section Inactive"}]
[]
["VLI DISSIMILARITY"]
["Unit Size","VLI Units","LI + MI Units","Dissimilarity"]
["0BR + 1BR",{"$f":"IF($B$52=TRUE, SUM($C$43:$C$44), \"\")","v":""},{"$f":"IF($B$52=TRUE, SUM($D$43:$E$44), \"\")","v":""},{"$f":"IFERROR(ABS(($B56/$B$60)-($C56/$C$60))/2, 0)","v":0}]
["2BR",{"$f":"IF($B$52=TRUE, SUM($C$45:$C$45), \"\")","v":""},{"$f":"IF($B$52=TRUE, SUM($D$45:$E$45), \"\")","v":""},{"$f":"IFERROR(ABS(($B57/$B$60)-($C57/$C$60))/2, 0)","v":0}]
["3BR",{"$f":"IF($B$52=TRUE, SUM($C$46:$C$46), \"\")","v":""},{"$f":"IF($B$52=TRUE, SUM($D$46:$E$46), \"\")","v":""},{"$f":"IFERROR(ABS(($B58/$B$60)-($C58/$C$60))/2, 0)","v":0}]
["4BR and over",{"$f":"IF($B$52=TRUE, SUM($C$47:$C$48), \"\")","v":""},{"$f":"IF($B$52=TRUE, SUM($D$47:$E$48), \"\")","v":""},{"$f":"IFERROR(ABS(($B59/$B$60)-($C59/$C$60))/2, 0)","v":0}]
["Total",{"$f":"IF($B$52=TRUE, SUM(B$56:B$59), \"\")","v":""},{"$f":"IF($B$52=TRUE, SUM(C$56:C$59), \"\")","v":""},{"$f":"IF($B$52=TRUE, SUM(D$56:D$59), \"\")","v":""}]
[]
["VLI ENTROPY"]
["Unit Size","VLI Units","LI + MI Units","Score","Index"]
["0BR + 1BR",{"$f":"IF($B$52=TRUE, SUM($C$43:$C$44), \"\")","v":""},{"$f":"IF($B$52=TRUE, SUM($D$43:$E$44), \"\")","v":""},{"$f":"IFERROR(($B64/SUM($B64:$C64))*LN(SUM($B64:$C64)/$B64), 0)+IFERROR(($C64/SUM($B64:$C64))*LN(SUM($B64:$C64)/$C64), 0)","v":0},{"$f":"IFERROR(SUM($B64:$C64)*($D$68-$D64)/($D$68*SUM($B$68:$C$68)), 0)","v":0}]
["2BR",{"$f":"IF($B$52=TRUE, SUM($C$45:$C$45), \"\")","v":""},{"$f":"IF($B$52=TRUE, SUM($D$45:$E$45), \"\")","v":""},{"$f":"IFERROR(($B65/SUM($B65:$C65))*LN(SUM($B65:$C65)/$B65), 0)+IFERROR(($C65/SUM($B65:$C65))*LN(SUM($B65:$C65)/$C65), 0)","v":0},{"$f":"IFERROR(SUM($B65:$C65)*($D$68-$D65)/($D$68*SUM($B$68:$C$68)), 0)","v":0}]
["3BR",{"$f":"IF($B$52=TRUE, SUM($C$46:$C$46), \"\")","v":""},{"$f":"IF($B$52=TRUE, SUM($D$46:$E$46), \"\")","v":""},{"$f":"IFERROR(($B66/SUM($B66:$C66))*LN(SUM($B66:$C66)/$B66), 0)+IFERROR(($C66/SUM($B66:$C66))*LN(SUM($B66:$C66)/$C66), 0)","v":0},{"$f":"IFERROR(SUM($B66:$C66)*($D$68-$D66)/($D$68*SUM($B$68:$C$68)), 0)","v":0}]
["4BR and over",{"$f":"IF($B$52=TRUE, SUM($C$47:$C$48), \"\")","v":""},{"$f":"IF($B$52=TRUE, SUM($D$47:$E$48), \"\")","v":""},{"$f":"IFERROR(($B67/SUM($B67:$C67))*LN(SUM($B67:$C67)/$B67), 0)+IFERROR(($C67/SUM($B67:$C67))*LN(SUM($B67:$C67)/$C67), 0)","v":0},{"$f":"IFERROR(SUM($B67:$C67)*($D$68-$D67)/($D$68*SUM($B$68:$C$68)), 0)","v":0}]
["Total",{"$f":"IF($B$52=TRUE, SUM(B$56:B$59), \"\")","v":""},{"$f":"IF($B$52=TRUE, SUM(C$56:C$59), \"\")","v":""},{"$f":"IFERROR(($B68/SUM($B68:$C68))*LN(SUM($B68:$C68)/$B68), 0)+IFERROR(($C68/SUM($B68:$C68))*LN(SUM($B68:$C68)/$C68), 0)","v":0},{"$f":"IF($B$52=TRUE, IFERROR(SUM($E$64:$E$67), 0), \"\")","v":""}]
[]
["AFFORDABILITY LEVELS",null,null,null,null,null,null,null,null,null,"Non-zero unit counts must be entered to activate section."]
["Section Active?",{"$f":"IF($B$3, IF(AND($B$17=TRUE, $B$30=TRUE, $B$39=TRUE), IF(COUNTIF($B$75:$B$85, \">\"&0)>0, TRUE, FALSE), FALSE), \"Calculator Inactive\")","v":"Calculator Inactive"}]
["Income Tiers","All Restricted Units","Very Low","Low","Moderate"]
["Unit Counts",{"$f":"IF($B$39=TRUE, $B$8, \"\")","v":""},{"$f":"IF($B$39=TRUE, $B$32, \"\")","v":""},{"$f":"IF($B$39=TRUE, $B$33, \"\")","v":""},{"$f":"IF($B$39=TRUE, $B$34, \"\")","v":""}]
["Percent of Median Income","Number of Units","Very Low","Low","Moderate",null,null,null,null,"Citation","Prior Round UHAC Requirement","Applicable?","Required","Operator","Actual","OK?","Optional?"]
[null,null,{"$f":"IF($B$71=TRUE, IF(AND($A75>0, $A75<=0.3, NOT(ISBLANK($B75))), $B75, \"\"), \"\")","v":""},{"$f":"IF($B$71=TRUE, IF(AND($A75>0.3, $A75<=0.5, NOT(ISBLANK($B75))), $B75, \"\"), \"\")","v":""},{"$f":"IF($B$71=TRUE, IF(AND($A75>0.5, $A75<=0.7, NOT(ISBLANK($B75))), $B75, \"\"), \"\")","v":""},{"$f":"IFERROR(_xlfn.RANK.EQ($A75, $A$75:$A$85, 1), \"\")","v":""},null,null,null,"(d)","Rental: Average rent affordable at 52% of median income",{"$f":"IF($B$3, IF($B$7=\"Rental\", TRUE, FALSE), \"\")","v":""},{"$f":"IF($L75=TRUE, 0.52, \"\")","v":""},">=",{"$f":"IF(AND($L75=TRUE, $B$71=TRUE), IFERROR(SUMPRODUCT($A$75:$A$85, $B$75:$B$85)/SUM($B$75:$B$85), \"ERROR\"), \"\")","v":""},{"$f":"IF(AND($L75=TRUE, $B$71=TRUE), IF($N75=\"=\", $M75=$O75, IF($N75=\"<=\", $M75<=$O75, IF($N75=\">=\", $M75>=$O75, IF($N75=\"N/A\", \"N/A\", \"ERROR\")))), \"\")","v":""}]
[null,null,"","","","",null,null,null,"(d)","Rental: Maximum rent affordable at 60% of median income",{"$f":"IF($B$3, IF($B$7=\"Rental\", TRUE, FALSE), \"\")","v":""},{"$f":"IF($L76=TRUE, 0.6, \"\")","v":""},">=",{"$f":"IF(AND($L76=TRUE, $B$71=TRUE), MAX($A$75:$A$85), \"\")","v":""},{"$f":"IF(AND($L76=TRUE, $B$71=TRUE), IF($N76=\"=\", $M76=$O76, IF($N76=\"<=\", $M76<=$O76, IF($N76=\">=\", $M76>=$O76, IF($N76=\"N/A\", \"N/A\", \"ERROR\")))), \"\")","v":""}]
[null,null,"","","",""]
[null,null,"","","",""]
[null,null,"","","","",null,null,null,"(d)","Rental: At least one rent for Very Low units",{"$f":"IF($B$3, IF(AND($B$7=\"Rental\", $B$32>0), TRUE, FALSE), \"\")","v":""},{"$f":"IF($L79=TRUE, 1, \"\")","v":""},"<=",{"$f":"IF(AND($L79=TRUE, $B$71=TRUE), IFERROR(COUNTIF($C$75:$C$85, \">\"&0), \"ERROR\"), \"\")","v":""},{"$f":"IF(AND($L79=TRUE, $B$71=TRUE), IF($N79=\"=\", $M79=$O79, IF($N79=\"<=\", $M79<=$O79, IF($N79=\">=\", $M79>=$O79, IF($N79=\"N/A\", \"N/A\", \"ERROR\")))), \"\")","v":""}]
[null,null,"","","","",null,null,null,"(d)","Rental: At least one rent for Low units",{"$f":"IF($B$3, IF(AND($B$7=\"Rental\", $B$33>0), TRUE, FALSE), \"\")","v":""},"","<=",{"$f":"IF(AND($L80=TRUE, $B$71=TRUE), IFERROR(COUNTIF($D$75:$D$85, \">\"&0), \"ERROR\"), \"\")","v":""},{"$f":"IF(AND($L80=TRUE, $B$71=TRUE), IF($N80=\"=\", $M80=$O80, IF($N80=\"<=\", $M80<=$O80, IF($N80=\">=\", $M80>=$O80, IF($N80=\"N/A\", \"N/A\", \"ERROR\")))), \"\")","v":""}]
[null,null,"","","","",null,null,null,"(d)","Rental: At least one rent for Moderate units",{"$f":"IF($B$3, IF(AND($B$7=\"Rental\", $B$34>0), TRUE, FALSE), \"\")","v":""},"","<=",{"$f":"IF(AND($L81=TRUE, $B$71=TRUE), IFERROR(COUNTIF($E$75:$E$85, \">\"&0), \"ERROR\"), \"\")","v":""},{"$f":"IF(AND($L81=TRUE, $B$71=TRUE), IF($N81=\"=\", $M81=$O81, IF($N81=\"<=\", $M81<=$O81, IF($N81=\">=\", $M81>=$O81, IF($N81=\"N/A\", \"N/A\", \"ERROR\")))), \"\")","v":""}]
[null,null,"","","",""]
[null,null,"","","","",null,null,null,"(e)","For-sale: Average sale price affordable at 55% of median income",{"$f":"IF($B$3, IF($B$7=\"For-sale\", TRUE, FALSE), \"\")","v":""},{"$f":"IF($L83=TRUE, 0.55, \"\")","v":""},">=",{"$f":"IF(AND($L83=TRUE, $B$71=TRUE), IFERROR(SUMPRODUCT($A$75:$A$85, $B$75:$B$85)/SUM($B$75:$B$85), \"ERROR\"), \"\")","v":""},{"$f":"IF(AND($L83=TRUE, $B$71=TRUE), IF($N83=\"=\", $M83=$O83, IF($N83=\"<=\", $M83<=$O83, IF($N83=\">=\", $M83>=$O83, IF($N83=\"N/A\", \"N/A\", \"ERROR\")))), \"\")","v":""}]
[null,null,"","","","",null,null,null,"(e)","For-sale: Maximum sale price affordable at 70% of median income",{"$f":"IF($B$3, IF($B$7=\"For-sale\", TRUE, FALSE), \"\")","v":""},{"$f":"IF($L84=TRUE, 0.7, \"\")","v":""},">=",{"$f":"IF(AND($L84=TRUE, $B$71=TRUE), MAX($A$75:$A$85), \"\")","v":""},{"$f":"IF(AND($L84=TRUE, $B$71=TRUE), IF($N84=\"=\", $M84=$O84, IF($N84=\"<=\", $M84<=$O84, IF($N84=\">=\", $M84>=$O84, IF($N84=\"N/A\", \"N/A\", \"ERROR\")))), \"\")","v":""}]
[null,null,"","","","",null,null,null,"(e)","For-sale: At least two different prices for Low units",{"$f":"IF($B$3, IF(AND($B$7=\"For-sale\", SUM($B$32:$B$33)>0), TRUE, FALSE), \"\")","v":""},{"$f":"IF($L85=TRUE, 2, \"\")","v":""},"<=",{"$f":"IF(AND($L85=TRUE, $B$71=TRUE), IFERROR(COUNTIF($C$75:$D$85, \">\"&0), \"ERROR\"), \"\")","v":""},{"$f":"IF(AND($L85=TRUE, $B$71=TRUE), IF($N85=\"=\", $M85=$O85, IF($N85=\"<=\", $M85<=$O85, IF($N85=\">=\", $M85>=$O85, IF($N85=\"N/A\", \"N/A\", \"ERROR\")))), \"\")","v":""}]
["Column Total",{"$f":"IF($B$71=TRUE, SUM(B$75:B$85), \"\")","v":""},{"$f":"IF($B$71=TRUE, SUM(C$75:C$85), \"\")","v":""},{"$f":"IF($B$71=TRUE, SUM(D$75:D$85), \"\")","v":""},{"$f":"IF($B$71=TRUE, SUM(E$75:E$85), \"\")","v":""},null,null,null,null,"(e)","For-sale: At least three different prices for Moderate units",{"$f":"IF($B$3, IF(AND($B$7=\"For-sale\", SUM($B$34:$B$34)>0), TRUE, FALSE), \"\")","v":""},{"$f":"IF($L86=TRUE, 3, \"\")","v":""},"<=",{"$f":"IF(AND($L86=TRUE, $B$71=TRUE), IFERROR(COUNTIF($E$75:$E$85, \">\"&0), \"ERROR\"), \"\")","v":""},{"$f":"IF(AND($L86=TRUE, $B$71=TRUE), IF($N86=\"=\", $M86=$O86, IF($N86=\"<=\", $M86<=$O86, IF($N86=\">=\", $M86>=$O86, IF($N86=\"N/A\", \"N/A\", \"ERROR\")))), \"\")","v":""}]
["Difference",{"$f":"IF($B$71=TRUE, B$86-B$73, \"\")","v":""},{"$f":"IF($B$71=TRUE, C$86-C$73, \"\")","v":""},{"$f":"IF($B$71=TRUE, D$86-D$73, \"\")","v":""},{"$f":"IF($B$71=TRUE, E$86-E$73, \"\")","v":""}]
["Affordability Average",{"$f":"IF($B$71=TRUE, IFERROR(SUMPRODUCT($A$75:$A$85, $B$75:$B$85)/SUM($B$75:$B$85), \"ERROR\"), \"\")","v":""},null,null,null,null,null,null,null,null,"OVERALL AFFORDABILITY LEVELS",{"$f":"IF($B$3, IF(COUNTIFS($L$75:$L$86, TRUE, $Q$75:$Q$86, \"<>\"&\"Yes\")>0, TRUE, FALSE), \"\")","v":""},{"$f":"IF($L88=TRUE, COUNTIFS($L$75:$L$86, TRUE, $Q$75:$Q$86, \"<>\"&\"Yes\"), \"\")","v":""},"=",{"$f":"IF(AND($L88=TRUE, $B$71=TRUE), COUNTIFS($P$75:$P$86, TRUE, $Q$75:$Q$86, \"<>\"&\"Yes\"), \"\")","v":""},{"$f":"IF(AND($L88=TRUE, $B$71=TRUE), IF($N88=\"=\", $M88=$O88, IF($N88=\"<=\", $M88<=$O88, IF($N88=\">=\", $M88>=$O88, IF($N88=\"N/A\", \"N/A\", \"ERROR\")))), \"\")","v":""}]
["Unit Counts Match?",{"$f":"IF($B$71=TRUE, IF(COUNTIF($B$87:$E$87, \"<>\"&0)=0, TRUE, FALSE), \"Section Inactive\")","v":"Section Inactive"}]
[]
["Percent of Median Income","Number of Units","Income Tier"]
[{"$f":"IFERROR(INDEX($A$75:$A$85, MATCH(1, $F$75:$F$85, 0)), \"\")","v":""},{"$f":"IF($A92=\"\", \"\", SUMIF($A$75:$A$85, $A92, $B$75:$B$85))","v":""},{"$f":"IF($A92=\"\", \"\", IF(AND($A92>0, $A92<=0.3), \"Very Low\", IF(AND($A92>0.3, $A92<=0.5), \"Low\", IF(AND($A92>0.5, $A92<=0.7), \"Moderate\", \"ERROR\"))))","v":""}]
[{"$f":"IFERROR(INDEX($A$75:$A$85, MATCH(2, $F$75:$F$85, 0)), \"\")","v":""},"",""]
[{"$f":"IFERROR(INDEX($A$75:$A$85, MATCH(3, $F$75:$F$85, 0)), \"\")","v":""},"",""]
[{"$f":"IFERROR(INDEX($A$75:$A$85, MATCH(4, $F$75:$F$85, 0)), \"\")","v":""},"",""]
[{"$f":"IFERROR(INDEX($A$75:$A$85, MATCH(5, $F$75:$F$85, 0)), \"\")","v":""},"",""]
[{"$f":"IFERROR(INDEX($A$75:$A$85, MATCH(6, $F$75:$F$85, 0)), \"\")","v":""},"",""]
[{"$f":"IFERROR(INDEX($A$75:$A$85, MATCH(7, $F$75:$F$85, 0)), \"\")","v":""},"",""]
[{"$f":"IFERROR(INDEX($A$75:$A$85, MATCH(8, $F$75:$F$85, 0)), \"\")","v":""},"",""]
[{"$f":"IFERROR(INDEX($A$75:$A$85, MATCH(9, $F$75:$F$85, 0)), \"\")","v":""},"",""]
[{"$f":"IFERROR(INDEX($A$75:$A$85, MATCH(10, $F$75:$F$85, 0)), \"\")","v":""},"",""]
[{"$f":"IFERROR(INDEX($A$75:$A$85, MATCH(11, $F$75:$F$85, 0)), \"\")","v":""},"",""]
["Income Tier","Count","First Row"]
["All Price/Rent Levels",{"$f":"COUNTA($A$92:$A$102)","v":11},{"$f":"IFERROR(MATCH($A104, $C$92:$C$102, 0) + ROW($C$91), \"N/A\")","v":"N/A"}]
["Very Low",{"$f":"COUNTIF($C$92:$C$102, \"Very Low\")","v":0},{"$f":"IFERROR(MATCH($A105, $C$92:$C$102, 0) + ROW($C$91), \"N/A\")","v":"N/A"}]
["Low",{"$f":"COUNTIF($C$92:$C$102, \"Low\")","v":0},{"$f":"IFERROR(MATCH($A106, $C$92:$C$102, 0) + ROW($C$91), \"N/A\")","v":"N/A"}]
["Moderate",{"$f":"COUNTIF($C$92:$C$102, \"Moderate\")","v":0},{"$f":"IFERROR(MATCH($A107, $C$92:$C$102, 0) + ROW($C$91), \"N/A\")","v":"N/A"}]
[]
["BEDROOMS + AFFORDABILITY",null,null,null,null,null,null,null,null,null,"Table disallows values greater than the row/column total."]
["Section Active?",{"$f":"IF($B$3, IF(AND($B$17=TRUE, $B$30=TRUE, $B$39=TRUE, $B$71=TRUE), IF((COUNTA($C$115:$F$120)+COUNTA($C$130:$F$135)+COUNTA($C$145:$F$150))>0, TRUE, FALSE), FALSE), \"Calculator Inactive\")","v":"Calculator Inactive"}]
["Very Low"]
["Income Levels",{"$f":"IF($B$71=TRUE, \"All \"&$A111, \"\")","v":""},{"$f":"IF($B$71=TRUE, IF(COLUMN(C111)-2<=INDEX($B$105:$B$107, MATCH($A111, $A$105:$A$107, 0)), INDIRECT(ADDRESS(COLUMN(C111)-3+INDEX($C$105:$C$107, MATCH($A111, $A$105:$A$107, 0)), 1)), \"N/A\"), \"\")","v":""},{"$f":"IF($B$71=TRUE, IF(COLUMN(D111)-2<=INDEX($B$105:$B$107, MATCH($A111, $A$105:$A$107, 0)), INDIRECT(ADDRESS(COLUMN(D111)-3+INDEX($C$105:$C$107, MATCH($A111, $A$105:$A$107, 0)), 1)), \"N/A\"), \"\")","v":""},{"$f":"IF($B$71=TRUE, IF(COLUMN(E111)-2<=INDEX($B$105:$B$107, MATCH($A111, $A$105:$A$107, 0)), INDIRECT(ADDRESS(COLUMN(E111)-3+INDEX($C$105:$C$107, MATCH($A111, $A$105:$A$107, 0)), 1)), \"N/A\"), \"\")","v":""},{"$f":"IF($B$71=TRUE, IF(COLUMN(F111)-2<=INDEX($B$105:$B$107, MATCH($A111, $A$105:$A$107, 0)), INDIRECT(ADDRESS(COLUMN(F111)-3+INDEX($C$105:$C$107, MATCH($A111, $A$105:$A$107, 0)), 1)), \"N/A\"), \"\")","v":""}]
["Unit Counts",{"$f":"IF($B$71=TRUE, SUMIF($C$92:$C$102, $A111, $B$92:$B$102), \"\")","v":""},{"$f":"IF($B$71=TRUE, IF(C112<>\"N/A\", INDEX($B$92:$B$102, MATCH(C112, $A$92:$A$102, 0)), 0), \"\")","v":""},{"$f":"IF($B$71=TRUE, IF(D112<>\"N/A\", INDEX($B$92:$B$102, MATCH(D112, $A$92:$A$102, 0)), 0), \"\")","v":""},{"$f":"IF($B$71=TRUE, IF(E112<>\"N/A\", INDEX($B$92:$B$102, MATCH(E112, $A$92:$A$102, 0)), 0), \"\")","v":""},{"$f":"IF($B$71=TRUE, IF(F112<>\"N/A\", INDEX($B$92:$B$102, MATCH(F112, $A$92:$A$102, 0)), 0), \"\")","v":""}]
["Bedroom Count","Bedroom Count Total",{"$f":"IF(C112<>\"N/A\", TEXT(C112, \"00%\")&\" Count\", \"N/A\")","v":" Count"},{"$f":"IF(D112<>\"N/A\", TEXT(D112, \"00%\")&\" Count\", \"N/A\")","v":" Count"}," Count"," Count","Row Total","Diff.",null,"Citation","Prior Round UHAC Requirement","Applicable?","Required","Operator","Actual","OK?","Optional?"]
["0BR",{"$f":"IF($B$71=TRUE, INDEX($C$43:$E$48, MATCH($A115, $A$43:$A$48, 0), MATCH($A$111, $C$42:$E$42, 0)), \"\")","v":""},null,null,null,null,{"$f":"IF($B$110=TRUE, SUMIF($C$112:$F$112, \"<>\"&\"N/A\", $C115:$F115), \"\")","v":""},{"$f":"IF($B$110=TRUE, $G115-$B115, \"\")","v":""},null,"(d)","Rental: At least one rent for Very Low 0BR + 1BR units",{"$f":"IF(AND($B$3, $B$26=TRUE, $B$36=TRUE), IF(AND($B$7=\"Rental\", $L$79=TRUE, SUM($C$43:$C$44)>0), TRUE, FALSE), \"\")","v":""},{"$f":"IF($L115=TRUE, 1, \"\")","v":""},"<=",{"$f":"IF(AND($L115=TRUE, $B$110=TRUE), COUNTIFS($C$112:$F$112, \"<>\"&\"N/A\", $C$115:$F$115, \">\"&0) + COUNTIFS($C$112:$F$112, \"<>\"&\"N/A\", $C$116:$F$116, \">\"&0), \"\")","v":""},{"$f":"IF(AND($L115=TRUE, $B$110=TRUE), IF($N115=\"=\", $M115=$O115, IF($N115=\"<=\", $M115<=$O115, IF($N115=\">=\", $M115>=$O115, IF($N115=\"N/A\", \"N/A\", \"ERROR\")))), \"\")","v":""}]
["1BR","",null,null,null,null,"","",null,"(d)","Rental: At least one rent for Very Low 2BR units",{"$f":"IF(AND($B$3, $B$26=TRUE, $B$36=TRUE), IF(AND($B$7=\"Rental\", $L$79=TRUE, SUM($C$45:$C$45)>0), TRUE, FALSE), \"\")","v":""},{"$f":"IF($L116=TRUE, 1, \"\")","v":""},"<=",{"$f":"IF(AND($L116=TRUE, $B$110=TRUE), COUNTIFS($C$112:$F$112, \"<>\"&\"N/A\", $C$117:$F$117, \">\"&0), \"\")","v":""},""]
["2BR","",null,null,null,null,"","",null,"(d)","Rental: At least one rent for Very Low 3BR units",{"$f":"IF(AND($B$3, $B$26=TRUE, $B$36=TRUE), IF(AND($B$7=\"Rental\", $L$79=TRUE, SUM($C$46:$C$46)>0), TRUE, FALSE), \"\")","v":""},"","<=",{"$f":"IF(AND($L117=TRUE, $B$110=TRUE), COUNTIFS($C$112:$F$112, \"<>\"&\"N/A\", $C$118:$F$118, \">\"&0), \"\")","v":""},""]
["3BR","",null,null,null,null,"","",null,"(d)","Rental: At least one rent for Very Low 4BR and over units",{"$f":"IF(AND($B$3, $B$26=TRUE, $B$36=TRUE), IF(AND($B$7=\"Rental\", $L$79=TRUE, SUM($C$47:$C$48)>0), TRUE, FALSE), \"\")","v":""},"","<=",{"$f":"IF(AND($L118=TRUE, $B$110=TRUE), COUNTIFS($C$112:$F$112, \"<>\"&\"N/A\", $C$119:$F$119, \">\"&0) + COUNTIFS($C$112:$F$112, \"<>\"&\"N/A\", $C$120:$F$120, \">\"&0), \"\")","v":""},""]
["4BR","",null,null,null,null,"","",null,"(d)","Rental: At least one rent for Low 0BR + 1BR units",{"$f":"IF(AND($B$3, $B$26=TRUE, $B$36=TRUE), IF(AND($B$7=\"Rental\", $L$80=TRUE, SUM($D$43:$D$44)>0), TRUE, FALSE), \"\")","v":""},"","<=",{"$f":"IF(AND($L119=TRUE, $B$110=TRUE), COUNTIFS($C$127:$F$127, \"<>\"&\"N/A\", $C$130:$F$130, \">\"&0) + COUNTIFS($C$127:$F$127, \"<>\"&\"N/A\", $C$131:$F$131, \">\"&0), \"\")","v":""},""]
["5BR","",null,null,null,null,"","",null,"(d)","Rental: At least one rent for Low 2BR units",{"$f":"IF(AND($B$3, $B$26=TRUE, $B$36=TRUE), IF(AND($B$7=\"Rental\", $L$80=TRUE, SUM($D$45:$D$45)>0), TRUE, FALSE), \"\")","v":""},"","<=",{"$f":"IF(AND($L120=TRUE, $B$110=TRUE), COUNTIFS($C$127:$F$127, \"<>\"&\"N/A\", $C$132:$F$132, \">\"&0), \"\")","v":""},""]
["Column Total",{"$f":"IF($B$110=TRUE, IF(B112<>\"N/A\", SUM(B115:B120), 0), \"\")","v":""},{"$f":"IF($B$110=TRUE, IF(C112<>\"N/A\", SUM(C115:C120), 0), \"\")","v":""},{"$f":"IF($B$110=TRUE, IF(D112<>\"N/A\", SUM(D115:D120), 0), \"\")","v":""},{"$f":"IF($B$110=TRUE, IF(E112<>\"N/A\", SUM(E115:E120), 0), \"\")","v":""},{"$f":"IF($B$110=TRUE, IF(F112<>\"N/A\", SUM(F115:F120), 0), \"\")","v":""},null,null,null,"(d)","Rental: At least one rent for Low 3BR units",{"$f":"IF(AND($B$3, $B$26=TRUE, $B$36=TRUE), IF(AND($B$7=\"Rental\", $L$80=TRUE, SUM($D$46:$D$46)>0), TRUE, FALSE), \"\")","v":""},"","<=",{"$f":"IF(AND($L121=TRUE, $B$110=TRUE), COUNTIFS($C$127:$F$127, \"<>\"&\"N/A\", $C$133:$F$133, \">\"&0), \"\")","v":""},""]
["Difference",{"$f":"IF($B$110=TRUE, B121-B113, \"\")","v":""},{"$f":"IF($B$110=TRUE, C121-C113, \"\")","v":""},{"$f":"IF($B$110=TRUE, D121-D113, \"\")","v":""},{"$f":"IF($B$110=TRUE, E121-E113, \"\")","v":""},{"$f":"IF($B$110=TRUE, F121-F113, \"\")","v":""},null,null,null,"(d)","Rental: At least one rent for Low 4BR and over units",{"$f":"IF(AND($B$3, $B$26=TRUE, $B$36=TRUE), IF(AND($B$7=\"Rental\", $L$80=TRUE, SUM($D$47:$D$48)>0), TRUE, FALSE), \"\")","v":""},"","<=",{"$f":"IF(AND($L122=TRUE, $B$110=TRUE), COUNTIFS($C$127:$F$127, \"<>\"&\"N/A\", $C$134:$F$134, \">\"&0) + COUNTIFS($C$127:$F$127, \"<>\"&\"N/A\", $C$135:$F$135, \">\"&0), \"\")","v":""},""]
["Row/Column Mismatches",{"$f":"IF($B$110=TRUE, COUNTIF($B122:$F122, \"<>\"&0)+COUNTIF($H115:$H120, \"<>\"&0), \"\")","v":""},null,null,null,null,null,null,null,"(d)","Rental: At least one rent for Moderate 0BR + 1BR units",{"$f":"IF(AND($B$3, $B$26=TRUE, $B$36=TRUE), IF(AND($B$7=\"Rental\", $L$81=TRUE, SUM($E$43:$E$44)>0), TRUE, FALSE), \"\")","v":""},"","<=",{"$f":"IF(AND($L123=TRUE, $B$110=TRUE), COUNTIFS($C$142:$F$142, \"<>\"&\"N/A\", $C$145:$F$145, \">\"&0) + COUNTIFS($C$142:$F$142, \"<>\"&\"N/A\", $C$146:$F$146, \">\"&0), \"\")","v":""},""]
[{"$f":"$A111&\" Unit Counts Valid?\"","v":"Very Low Unit Counts Valid?"},{"$f":"IF($B$110=TRUE, IF($B123=0, TRUE, FALSE), \"Section Inactive\")","v":"Section Inactive"},null,null,null,null,null,null,null,"(d)","Rental: At least one rent for Moderate 2BR units",{"$f":"IF(AND($B$3, $B$26=TRUE, $B$36=TRUE), IF(AND($B$7=\"Rental\", $L$81=TRUE, SUM($E$45:$E$45)>0), TRUE, FALSE), \"\")","v":""},"","<=",{"$f":"IF(AND($L124=TRUE, $B$110=TRUE), COUNTIFS($C$142:$F$142, \"<>\"&\"N/A\", $C$147:$F$147, \">\"&0), \"\")","v":""},""]
[null,null,null,null,null,null,null,null,null,"(d)","Rental: At least one rent for Moderate 3BR units",{"$f":"IF(AND($B$3, $B$26=TRUE, $B$36=TRUE), IF(AND($B$7=\"Rental\", $L$81=TRUE, SUM($E$46:$E$46)>0), TRUE, FALSE), \"\")","v":""},"","<=",{"$f":"IF(AND($L125=TRUE, $B$110=TRUE), COUNTIFS($C$142:$F$142, \"<>\"&\"N/A\", $C$148:$F$148, \">\"&0), \"\")","v":""},""]
["Low",null,null,null,null,null,null,null,null,"(d)","Rental: At least one rent for Moderate 4BR and over units",{"$f":"IF(AND($B$3, $B$26=TRUE, $B$36=TRUE), IF(AND($B$7=\"Rental\", $L$81=TRUE, SUM($E$47:$E$48)>0), TRUE, FALSE), \"\")","v":""},"","<=",{"$f":"IF(AND($L126=TRUE, $B$110=TRUE), COUNTIFS($C$142:$F$142, \"<>\"&\"N/A\", $C$149:$F$149, \">\"&0) + COUNTIFS($C$142:$F$142, \"<>\"&\"N/A\", $C$150:$F$150, \">\"&0), \"\")","v":""},""]
["Income Levels",{"$f":"IF($B$71=TRUE, \"All \"&$A126, \"\")","v":""},{"$f":"IF($B$71=TRUE, IF(COLUMN(C126)-2<=INDEX($B$105:$B$107, MATCH($A126, $A$105:$A$107, 0)), INDIRECT(ADDRESS(COLUMN(C126)-3+INDEX($C$105:$C$107, MATCH($A126, $A$105:$A$107, 0)), 1)), \"N/A\"), \"\")","v":""},{"$f":"IF($B$71=TRUE, IF(COLUMN(D126)-2<=INDEX($B$105:$B$107, MATCH($A126, $A$105:$A$107, 0)), INDIRECT(ADDRESS(COLUMN(D126)-3+INDEX($C$105:$C$107, MATCH($A126, $A$105:$A$107, 0)), 1)), \"N/A\"), \"\")","v":""},{"$f":"IF($B$71=TRUE, IF(COLUMN(E126)-2<=INDEX($B$105:$B$107, MATCH($A126, $A$105:$A$107, 0)), INDIRECT(ADDRESS(COLUMN(E126)-3+INDEX($C$105:$C$107, MATCH($A126, $A$105:$A$107, 0)), 1)), \"N/A\"), \"\")","v":""},{"$f":"IF($B$71=TRUE, IF(COLUMN(F126)-2<=INDEX($B$105:$B$107, MATCH($A126, $A$105:$A$107, 0)), INDIRECT(ADDRESS(COLUMN(F126)-3+INDEX($C$105:$C$107, MATCH($A126, $A$105:$A$107, 0)), 1)), \"N/A\"), \"\")","v":""}]
["Unit Counts",{"$f":"IF($B$71=TRUE, SUMIF($C$92:$C$102, $A126, $B$92:$B$102), \"\")","v":""},{"$f":"IF($B$71=TRUE, IF(C127<>\"N/A\", INDEX($B$92:$B$102, MATCH(C127, $A$92:$A$102, 0)), 0), \"\")","v":""},{"$f":"IF($B$71=TRUE, IF(D127<>\"N/A\", INDEX($B$92:$B$102, MATCH(D127, $A$92:$A$102, 0)), 0), \"\")","v":""},{"$f":"IF($B$71=TRUE, IF(E127<>\"N/A\", INDEX($B$92:$B$102, MATCH(E127, $A$92:$A$102, 0)), 0), \"\")","v":""},{"$f":"IF($B$71=TRUE, IF(F127<>\"N/A\", INDEX($B$92:$B$102, MATCH(F127, $A$92:$A$102, 0)), 0), \"\")","v":""},null,null,null,"(e)","For-sale: At least two different prices for Low 0BR + 1BR units",{"$f":"IF(AND($B$3, $B$26=TRUE, $B$36=TRUE), IF(AND($B$7=\"For-sale\", $L$85=TRUE, SUM($C$43:$D$44)>0), TRUE, FALSE), \"\")","v":""},{"$f":"IF($L128=TRUE, 2, \"\")","v":""},"<=",{"$f":"IF(AND($L128=TRUE, $B$110=TRUE), COUNTIFS($C$112:$F$112, \"<>\"&\"N/A\", $C$115:$F$115, \">\"&0)+COUNTIFS($C$112:$F$112, \"<>\"&\"N/A\", $C$116:$F$116, \">\"&0)+COUNTIFS($C$127:$F$127, \"<>\"&\"N/A\", $C$130:$F$130, \">\"&0)+COUNTIFS($C$127:$F$127, \"<>\"&\"N/A\", $C$131:$F$131, \">\"&0), \"\")","v":""},{"$f":"IF(AND($L128=TRUE, $B$110=TRUE), IF($N128=\"=\", $M128=$O128, IF($N128=\"<=\", $M128<=$O128, IF($N128=\">=\", $M128>=$O128, IF($N128=\"N/A\", \"N/A\", \"ERROR\")))), \"\")","v":""}]
["Bedroom Count","Bedroom Count Total",{"$f":"IF(C127<>\"N/A\", TEXT(C127, \"00%\")&\" Count\", \"N/A\")","v":" Count"},{"$f":"IF(D127<>\"N/A\", TEXT(D127, \"00%\")&\" Count\", \"N/A\")","v":" Count"}," Count"," Count","Row Total","Diff.",null,"(e)","For-sale: At least two different prices for Low 2BR units",{"$f":"IF(AND($B$3, $B$26=TRUE, $B$36=TRUE), IF(AND($B$7=\"For-sale\", $L$85=TRUE, SUM($C$45:$D$45)>0), TRUE, FALSE), \"\")","v":""},{"$f":"IF($L129=TRUE, 2, \"\")","v":""},"<=",{"$f":"IF(AND($L129=TRUE, $B$110=TRUE), COUNTIFS($C$112:$F$112, \"<>\"&\"N/A\", $C$117:$F$117, \">\"&0)+COUNTIFS($C$127:$F$127, \"<>\"&\"N/A\", $C$132:$F$132, \">\"&0), \"\")","v":""},""]
["0BR",{"$f":"IF($B$71=TRUE, INDEX($C$43:$E$48, MATCH($A130, $A$43:$A$48, 0), MATCH($A$126, $C$42:$E$42, 0)), \"\")","v":""},null,null,null,null,{"$f":"IF($B$110=TRUE, SUMIF($C$127:$F$127, \"<>\"&\"N/A\", $C130:$F130), \"\")","v":""},{"$f":"IF($B$110=TRUE, $G130-$B130, \"\")","v":""},null,"(e)","For-sale: At least two different prices for Low 3BR units",{"$f":"IF(AND($B$3, $B$26=TRUE, $B$36=TRUE), IF(AND($B$7=\"For-sale\", $L$85=TRUE, SUM($C$46:$D$46)>0), TRUE, FALSE), \"\")","v":""},"","<=",{"$f":"IF(AND($L130=TRUE, $B$110=TRUE), COUNTIFS($C$112:$F$112, \"<>\"&\"N/A\", $C$118:$F$118, \">\"&0)+COUNTIFS($C$127:$F$127, \"<>\"&\"N/A\", $C$133:$F$133, \">\"&0), \"\")","v":""},""]
["1BR","",null,null,null,null,"","",null,"(e)","For-sale: At least two different prices for Low 4BR and over units",{"$f":"IF(AND($B$3, $B$26=TRUE, $B$36=TRUE), IF(AND($B$7=\"For-sale\", $L$85=TRUE, SUM($C$47:$D$48)>0), TRUE, FALSE), \"\")","v":""},"","<=",{"$f":"IF(AND($L131=TRUE, $B$110=TRUE), COUNTIFS($C$112:$F$112, \"<>\"&\"N/A\", $C$119:$F$119, \">\"&0)+COUNTIFS($C$112:$F$112, \"<>\"&\"N/A\", $C$120:$F$120, \">\"&0)+COUNTIFS($C$127:$F$127, \"<>\"&\"N/A\", $C$134:$F$134, \">\"&0)+COUNTIFS($C$127:$F$127, \"<>\"&\"N/A\", $C$135:$F$135, \">\"&0), \"\")","v":""},""]
["2BR","",null,null,null,null,"","",null,"(e)","For-sale: At least three different prices for Moderate 0BR + 1BR units",{"$f":"IF(AND($B$3, $B$26=TRUE, $B$36=TRUE), IF(AND($B$7=\"For-sale\", $L$86=TRUE, SUM($E$43:$E$44)>0), TRUE, FALSE), \"\")","v":""},{"$f":"IF($L132=TRUE, 3, \"\")","v":""},"<=",{"$f":"IF(AND($L132=TRUE, $B$110=TRUE), COUNTIFS($C$142:$F$142, \"<>\"&\"N/A\", $C$145:$F$145, \">\"&0)+COUNTIFS($C$142:$F$142, \"<>\"&\"N/A\", $C$146:$F$146, \">\"&0), \"\")","v":""},""]
["3BR","",null,null,null,null,"","",null,"(e)","For-sale: At least three different prices for Moderate 2BR units",{"$f":"IF(AND($B$3, $B$26=TRUE, $B$36=TRUE), IF(AND($B$7=\"For-sale\", $L$86=TRUE, SUM($E$45:$E$45)>0), TRUE, FALSE), \"\")","v":""},{"$f":"IF($L133=TRUE, 3, \"\")","v":""},"<=",{"$f":"IF(AND($L133=TRUE, $B$110=TRUE), COUNTIFS($C$142:$F$142, \"<>\"&\"N/A\", $C$147:$F$147, \">\"&0), \"\")","v":""},""]
["4BR","",null,null,null,null,"","",null,"(e)","For-sale: At least three different prices for Moderate 3BR units",{"$f":"IF(AND($B$3, $B$26=TRUE, $B$36=TRUE), IF(AND($B$7=\"For-sale\", $L$86=TRUE, SUM($E$46:$E$46)>0), TRUE, FALSE), \"\")","v":""},{"$f":"IF($L134=TRUE, 3, \"\")","v":""},"<=",{"$f":"IF(AND($L134=TRUE, $B$110=TRUE), COUNTIFS($C$142:$F$142, \"<>\"&\"N/A\", $C$148:$F$148, \">\"&0), \"\")","v":""},""]
["5BR","",null,null,null,null,"","",null,"(e)","For-sale: At least three different prices for Moderate 4BR and over units",{"$f":"IF(AND($B$3, $B$26=TRUE, $B$36=TRUE), IF(AND($B$7=\"For-sale\", $L$86=TRUE, SUM($E$47:$E$48)>0), TRUE, FALSE), \"\")","v":""},{"$f":"IF($L135=TRUE, 3, \"\")","v":""},"<=",{"$f":"IF(AND($L135=TRUE, $B$110=TRUE), COUNTIFS($C$142:$F$142, \"<>\"&\"N/A\", $C$149:$F$149, \">\"&0)+COUNTIFS($C$142:$F$142, \"<>\"&\"N/A\", $C$150:$F$150, \">\"&0), \"\")","v":""},""]
["Column Total",{"$f":"IF($B$110=TRUE, IF(B127<>\"N/A\", SUM(B130:B135), 0), \"\")","v":""},{"$f":"IF($B$110=TRUE, IF(C127<>\"N/A\", SUM(C130:C135), 0), \"\")","v":""},{"$f":"IF($B$110=TRUE, IF(D127<>\"N/A\", SUM(D130:D135), 0), \"\")","v":""},{"$f":"IF($B$110=TRUE, IF(E127<>\"N/A\", SUM(E130:E135), 0), \"\")","v":""},{"$f":"IF($B$110=TRUE, IF(F127<>\"N/A\", SUM(F130:F135), 0), \"\")","v":""}]
["Difference",{"$f":"IF($B$110=TRUE, B136-B128, \"\")","v":""},{"$f":"IF($B$110=TRUE, C136-C128, \"\")","v":""},{"$f":"IF($B$110=TRUE, D136-D128, \"\")","v":""},{"$f":"IF($B$110=TRUE, E136-E128, \"\")","v":""},{"$f":"IF($B$110=TRUE, F136-F128, \"\")","v":""},null,null,null,null,"OVERALL BEDROOMS + AFFORDABILITY",{"$f":"IF($B$3, IF(COUNTIFS($L$115:$L$135, TRUE, $Q$115:$Q$135, \"<>\"&\"Yes\")>0, TRUE, FALSE), \"\")","v":""},{"$f":"IF($L137=TRUE, COUNTIFS($L$115:$L$135, TRUE, $Q$115:$Q$135, \"<>\"&\"Yes\"), \"\")","v":""},"=",{"$f":"IF(AND($L137=TRUE, $B$110=TRUE), COUNTIFS($P$115:$P$135, TRUE, $Q$115:$Q$135, \"<>\"&\"Yes\"), \"\")","v":""},{"$f":"IF(AND($L137=TRUE, $B$110=TRUE), IF($N137=\"=\", $M137=$O137, IF($N137=\"<=\", $M137<=$O137, IF($N137=\">=\", $M137>=$O137, IF($N137=\"N/A\", \"N/A\", \"ERROR\")))), \"\")","v":""}]
["Row/Column Mismatches",{"$f":"IF($B$110=TRUE, COUNTIF($B137:$F137, \"<>\"&0)+COUNTIF($H130:$H135, \"<>\"&0), \"\")","v":""}]
[{"$f":"$A126&\" Unit Counts Valid?\"","v":"Low Unit Counts Valid?"},{"$f":"IF($B$110=TRUE, IF($B138=0, TRUE, FALSE), \"Section Inactive\")","v":"Section Inactive"}]
[]
["Moderate"]
["Income Levels",{"$f":"IF($B$71=TRUE, \"All \"&$A141, \"\")","v":""},{"$f":"IF($B$71=TRUE, IF(COLUMN(C141)-2<=INDEX($B$105:$B$107, MATCH($A141, $A$105:$A$107, 0)), INDIRECT(ADDRESS(COLUMN(C141)-3+INDEX($C$105:$C$107, MATCH($A141, $A$105:$A$107, 0)), 1)), \"N/A\"), \"\")","v":""},{"$f":"IF($B$71=TRUE, IF(COLUMN(D141)-2<=INDEX($B$105:$B$107, MATCH($A141, $A$105:$A$107, 0)), INDIRECT(ADDRESS(COLUMN(D141)-3+INDEX($C$105:$C$107, MATCH($A141, $A$105:$A$107, 0)), 1)), \"N/A\"), \"\")","v":""},{"$f":"IF($B$71=TRUE, IF(COLUMN(E141)-2<=INDEX($B$105:$B$107, MATCH($A141, $A$105:$A$107, 0)), INDIRECT(ADDRESS(COLUMN(E141)-3+INDEX($C$105:$C$107, MATCH($A141, $A$105:$A$107, 0)), 1)), \"N/A\"), \"\")","v":""},{"$f":"IF($B$71=TRUE, IF(COLUMN(F141)-2<=INDEX($B$105:$B$107, MATCH($A141, $A$105:$A$107, 0)), INDIRECT(ADDRESS(COLUMN(F141)-3+INDEX($C$105:$C$107, MATCH($A141, $A$105:$A$107, 0)), 1)), \"N/A\"), \"\")","v":""}]
["Unit Counts",{"$f":"IF($B$71=TRUE, SUMIF($C$92:$C$102, $A141, $B$92:$B$102), \"\")","v":""},{"$f":"IF($B$71=TRUE, IF(C142<>\"N/A\", INDEX($B$92:$B$102, MATCH(C142, $A$92:$A$102, 0)), 0), \"\")","v":""},{"$f":"IF($B$71=TRUE, IF(D142<>\"N/A\", INDEX($B$92:$B$102, MATCH(D142, $A$92:$A$102, 0)), 0), \"\")","v":""},{"$f":"IF($B$71=TRUE, IF(E142<>\"N/A\", INDEX($B$92:$B$102, MATCH(E142, $A$92:$A$102, 0)), 0), \"\")","v":""},{"$f":"IF($B$71=TRUE, IF(F142<>\"N/A\", INDEX($B$92:$B$102, MATCH(F142, $A$92:$A$102, 0)), 0), \"\")","v":""}]
["Bedroom Count","Bedroom Count Total",{"$f":"IF(C142<>\"N/A\", TEXT(C142, \"00%\")&\" Count\", \"N/A\")","v":" Count"},{"$f":"IF(D142<>\"N/A\", TEXT(D142, \"00%\")&\" Count\", \"N/A\")","v":" Count"}," Count"," Count","Row Total","Diff."]
["0BR",{"$f":"IF($B$71=TRUE, INDEX($C$43:$E$48, MATCH($A145, $A$43:$A$48, 0), MATCH($A$141, $C$42:$E$42, 0)), \"\")","v":""},null,null,null,null,{"$f":"IF($B$110=TRUE, SUMIF($C$142:$F$142, \"<>\"&\"N/A\", $C145:$F145), \"\")","v":""},{"$f":"IF($B$110=TRUE, $G145-$B145, \"\")","v":""}]
["1BR","",null,null,null,null,"",""]
["2BR","",null,null,null,null,"",""]
["3BR","",null,null,null,null,"",""]
["4BR","",null,null,null,null,"",""]
["5BR","",null,null,null,null,"",""]
["Column Total",{"$f":"IF($B$110=TRUE, IF(B142<>\"N/A\", SUM(B145:B150), 0), \"\")","v":""},{"$f":"IF($B$110=TRUE, IF(C142<>\"N/A\", SUM(C145:C150), 0), \"\")","v":""},{"$f":"IF($B$110=TRUE, IF(D142<>\"N/A\", SUM(D145:D150), 0), \"\")","v":""},{"$f":"IF($B$110=TRUE, IF(E142<>\"N/A\", SUM(E145:E150), 0), \"\")","v":""},{"$f":"IF($B$110=TRUE, IF(F142<>\"N/A\", SUM(F145:F150), 0), \"\")","v":""}]
["Difference",{"$f":"IF($B$110=TRUE, B151-B143, \"\")","v":""},{"$f":"IF($B$110=TRUE, C151-C143, \"\")","v":""},{"$f":"IF($B$110=TRUE, D151-D143, \"\")","v":""},{"$f":"IF($B$110=TRUE, E151-E143, \"\")","v":""},{"$f":"IF($B$110=TRUE, F151-F143, \"\")","v":""}]
["Row/Column Mismatches",{"$f":"IF($B$110=TRUE, COUNTIF($B152:$F152, \"<>\"&0)+COUNTIF($H145:$H150, \"<>\"&0), \"\")","v":""}]
[{"$f":"$A141&\" Unit Counts Valid?\"","v":"Moderate Unit Counts Valid?"},{"$f":"IF($B$110=TRUE, IF($B153=0, TRUE, FALSE), \"Section Inactive\")","v":"Section Inactive"}]
[]
["All Unit Counts Valid?",{"$f":"IF($B$110=TRUE, IF(AND($B$124=TRUE, $B$139=TRUE, $B$154=TRUE), TRUE, FALSE), \"Section Inactive\")","v":"Section Inactive"}]
[]
["FINAL BREAKDOWN",null,null,null,null,null,null,null,null,null,"Final Breakdown table will not populate unless all sections are active."]
["All Sections Active?",{"$f":"IF($B$3=TRUE, IF($L$12=0, \"YES\", \"NO\"), \"Calculator Inactive\")","v":"Calculator Inactive"}]
["Bedroom Count ","0BR","1BR","2BR","3BR","4BR","5BR","TOTAL"]
["Income Levels"]
[{"$f":"IF($B$159=\"YES\", IF($A92=\"\", \"\", $A92), \"\")","v":""},{"$f":"IF($B$159=\"YES\", IF(AND($A162>0, $A162<=0.3), INDEX($C$115:$F$120, MATCH(B$160, $A$115:$A$120, 0), MATCH($A162, $C$112:$F$112, 0)), IF(AND($A162>0.3, $A162<=0.5), INDEX($C$130:$F$135, MATCH(B$160, $A$130:$A$135, 0), MATCH($A162, $C$127:$F$127, 0)), IF(AND($A162>0.5, $A162<=0.7), INDEX($C$145:$F$150, MATCH(B$160, $A$145:$A$150, 0), MATCH($A162, $C$142:$F$142, 0)), \"\"))), \"\")","v":""},"","","","","",{"$f":"IF(AND($B$159=\"YES\", $A162<>\"\"), SUM($B162:$G162), \"\")","v":""}]
["","","","","","","",{"$f":"IF(AND($B$159=\"YES\", $A163<>\"\"), SUM($B163:$G163), \"\")","v":""}]
["","","","","","","",""]
["","","","","","","",""]
["","","","","","","",""]
["","","","","","","",""]
["","","","","","","",""]
["","","","","","","",""]
["","","","","","","",""]
["","","","","","","",""]
["","","","","","","",""]
["TOTAL",{"$f":"IF($B$159=\"YES\", SUM(B$162:B$172), \"\")","v":""},{"$f":"IF($B$159=\"YES\", SUM(C$162:C$172), \"\")","v":""},"","","","",""]
[]
["Disclaimer: This document is a tool to assist with the affordability average and bedroom distribution calculations under the 2004 UHAC regulations, which were effective from December 20, 2004, to December 20, 2024. These materials are for educational, non-commercial, discussion purposes only, and should not be relied on for business, legal, or financial decisions. Any use of these materials and the computations made in these materials for business, legal, and financial advice must be tailored to the specific circumstances of each case. Nothing provided herein should be used as a substitute for the advice of competent professionals. NJHMFA makes no claim, promise, guarantee or representation as to the suitability, reliability, appropriateness or accuracy of the information contained in these materials."]

{"sheet":"Data Validation","index":2,"n_rows":8,"n_cols":14,"rows_kept":8,"cut":false,"hidden":true,"merged":[]}
["Quick Population",null,"Population",null,"Tenure",null,"Structure Type",null,"Unit Size","Bedroom Count",null,"Income Restriction",null,"Y/N"]
["Family",null,"Family",null,"For-sale",null,"High rise with elevator",null,"Studio/eff.",0,null,"Very-low income (30% RMI)",null,"Yes"]
["Age-restricted/supportive",null,"Age-restricted",null,"Rental",null,"Low-rise",null,"1BR",1,null,"Low income (50% RMI)",null,"No"]
[null,null,"Supportive housing",null,null,null,"Manufactured home",null,"2BR",2,null,"Moderate income (80% RMI)"]
[null,null,null,null,null,null,"Rowhouse/townhouse",null,"3BR",3,null,"None (market-rate)"]
[null,null,null,null,null,null,"Semi-detached",null,"4BR",4]
[null,null,null,null,null,null,"Single family detached",null,"5BR",5]
[null,null,null,null,null,null,null,null,"6BR",6]

{"sheet":"Counties","index":3,"n_rows":22,"n_cols":3,"rows_kept":22,"cut":false,"hidden":true,"merged":[]}
["County","Region","Region Name"]
["Atlantic",6,"South-Southwest"]
["Bergen",1,"Northeast"]
["Burlington",5,"Southwest"]
["Camden",5,"Southwest"]
["Cape May",6,"South-Southwest"]
["Cumberland",6,"South-Southwest"]
["Essex",2,"Northwest"]
["Gloucester",5,"Southwest"]
["Hudson",1,"Northeast"]
["Hunterdon",3,"West Central"]
["Mercer",4,"East Central"]
["Middlesex",3,"West Central"]
["Monmouth",4,"East Central"]
["Morris",2,"Northwest"]
["Ocean",4,"East Central"]
["Passaic",1,"Northeast"]
["Salem",6,"South-Southwest"]
["Somerset",3,"West Central"]
["Sussex",1,"Northeast"]
["Union",2,"Northwest"]
["Warren",2,"Northwest"]

{"sheet":"Municipalities","index":4,"n_rows":565,"n_cols":17,"rows_kept":565,"cut":false,"hidden":true,"merged":[]}
["County Subdivision FIPS Code","DCA Municode","Municipality","County","Region","Present Need","Qualified Urban Aid Municipality","Equalized Nonresidential Valuation Factor","Land Capacity Factor","Income Capacity Factor","Average Allocation Factor","Prospective Need","Prospective Need >1,000?","Total Households (2020 Census)","Subject to 1,000/20% Cap? (PN>1,000 or PN>20% of Occ. Hsg)","Cap","Prospective Need Obligation with 1,000/20% Cap"]
[3400100100,"0101","Absecon city","Atlantic",6,39,0,9.6544336444310229E-3,1.1143708153858104E-2,1.4401505167369088E-2,1.1733215655219405E-2,22,0,3614,0,723,22]
[3400102080,"0102","Atlantic City","Atlantic",6,875,1,0,0,0,0,0,0,15859,0,1000,0]
[3400107810,"0103","Brigantine city","Atlantic",6,13,0,9.7558871646873241E-3,0,2.1035177597171415E-2,1.0263688253952912E-2,19,0,3798,0,760,19]
[3400108680,"0104","Buena borough","Atlantic",6,3,0,1.2347653209132383E-3,4.5145301093290328E-4,1.2565415128675941E-2,4.7505444868406943E-3,9,0,1766,0,353,9]
[3400108710,"0105","Buena Vista township","Atlantic",6,22,0,7.353648192267242E-3,5.3278613880365254E-4,1.3536534504933818E-2,7.1409896120015704E-3,13,0,2750,0,550,13]
[3400115160,"0106","Corbin City","Atlantic",6,0,0,5.8824216259497838E-4,0,8.3695983815199812E-3,2.9859468480383199E-3,6,0,187,0,37,6]
[3400120290,"0108","Egg Harbor township","Atlantic",6,164,0,9.1879546097405243E-2,7.7664056082073704E-2,6.4887854670463055E-2,7.8143818949980667E-2,148,0,17065,0,1000,148]
[3400120350,"0107","Egg Harbor City","Atlantic",6,61,0,3.9740394898468033E-3,5.1074476489045622E-3,5.2720313752954674E-3,4.7845061713489437E-3,9,0,1712,0,342,9]
[3400121870,"0109","Estell Manor city","Atlantic",6,0,0,6.503100575965461E-4,0,1.4548636076064152E-2,5.0663153778868998E-3,10,0,631,0,126,10]
[3400123940,"0110","Folsom borough","Atlantic",6,0,0,3.4385212941542066E-3,0,1.4550842393259057E-2,5.996454562471088E-3,11,0,671,0,134,11]
[3400125560,"0111","Galloway township","Atlantic",6,260,0,4.6718067415615717E-2,4.4966592848251649E-2,4.9594378901642318E-2,4.7093013055169893E-2,89,0,13679,0,1000,89]
[3400129280,"0112","Hamilton township","Atlantic",6,13,0,3.0361298743954955E-2,3.2254229471750703E-2,4.0469192999914159E-2,3.4361573738539937E-2,65,0,10462,0,1000,65]
[3400129430,"0113","Hammonton town","Atlantic",6,64,0,2.7313964612758306E-2,2.7986054165471803E-2,2.2466485104893557E-2,2.5922167961041225E-2,49,0,5456,0,1000,49]
[3400140530,"0114","Linwood city","Atlantic",6,49,0,9.0769591552553562E-3,1.0856166200131653E-3,2.9352918824862136E-2,1.3171831533376886E-2,25,0,2643,0,529,25]
[3400141370,"0115","Longport borough","Atlantic",6,0,0,-1.8113470721460031E-4,0,1.1712225324683776E-2,3.8436968724897252E-3,7,0,452,0,90,7]
[3400143890,"0116","Margate City","Atlantic",6,19,0,1.0837134162448152E-2,0,2.3145583111511256E-2,1.1327572424653135E-2,21,0,2651,0,530,21]
[3400149410,"0117","Mullica township","Atlantic",6,0,0,2.3773280663161125E-3,3.6867855695497261E-3,1.4826641090391352E-2,6.9635849087523972E-3,13,0,2196,0,439,13]
[3400152950,"0118","Northfield city","Atlantic",6,10,0,1.3346942295884085E-2,1.6391782233695028E-3,2.3014545299297542E-2,1.266688860618371E-2,24,0,3116,0,623,24]
[3400159640,"0119","Pleasantville city","Atlantic",6,294,1,0,0,0,0,0,0,7252,0,1000,0]
[3400160600,"0120","Port Republic city","Atlantic",6,10,0,4.6786562103177725E-4,0,1.6181722497982855E-2,5.5498627063382102E-3,10,0,409,0,82,10]
[3400168430,"0121","Somers Point city","Atlantic",6,27,0,3.379551019292483E-2,5.4389900717215884E-4,1.503041016922305E-2,1.6456606456440013E-2,31,0,4844,0,969,31]
[3400175620,"0122","Ventnor City","Atlantic",6,24,0,6.9176669452499524E-3,0,1.5548872752517564E-2,7.4888465659225063E-3,14,0,4296,0,859,14]
[3400180330,"0123","Weymouth township","Atlantic",6,0,0,3.7018195796355456E-3,0,7.7223952736924263E-3,3.8080716177759911E-3,7,0,1207,0,241,7]
[3400300700,"0201","Allendale borough","Bergen",1,159,0,5.5508777545351445E-3,1.2057056296230877E-2,1.0497779645771576E-2,9.3685712321791986E-3,260,0,2327,0,465,260]
[3400301090,"0202","Alpine borough","Bergen",1,0,0,1.7461957358245515E-3,1.4135050743536891E-2,1.1902314702182677E-2,9.2611870605147067E-3,257,0,587,1,117,117]
[3400305170,"0203","Bergenfield borough","Bergen",1,137,1,0,0,0,0,0,0,9097,0,1000,0]
[3400306490,"0204","Bogota borough","Bergen",1,26,0,2.2873918759205281E-3,6.226479468134467E-4,6.5995389704103409E-3,3.1698595977147719E-3,88,0,2939,0,588,88]
[3400310480,"0205","Carlstadt borough","Bergen",1,0,0,5.144577064325493E-2,8.6451595595478579E-5,3.7127758917642898E-3,1.8414999376871567E-2,511,0,2429,1,486,486]
[3400313570,"0206","Cliffside Park borough","Bergen",1,150,1,0,0,0,0,0,0,10735,0,1000,0]
[3400313810,"0207","Closter borough","Bergen",1,16,0,8.3898645502371652E-3,5.7440041898492713E-3,1.3038939314940632E-2,9.0576026850090231E-3,251,0,2762,0,552,251]
[3400315820,"0208","Cresskill borough","Bergen",1,0,0,3.9967811906845511E-3,1.0501668380557153E-3,1.1666201364313782E-2,5.5710497976846829E-3,155,0,3015,0,603,155]
[3400317530,"0209","Demarest borough","Bergen",1,0,0,3.2278195494441988E-4,1.4845462617563792E-3,9.6308858618857039E-3,3.8127380261955006E-3,106,0,1598,0,320,106]
[3400318400,"0210","Dumont borough","Bergen",1,16,0,2.9684124360818019E-3,6.0271357577090312E-4,1.0257996491538152E-2,4.6097075011302859E-3,128,0,6408,0,1000,128]
[3400319510,"0212","East Rutherford borough","Bergen",1,53,0,3.2673514093486317E-2,6.8723865998461253E-3,5.0097825212063333E-3,1.4851894404846258E-2,412,0,4306,0,861,412]
[3400320020,"0213","Edgewater borough","Bergen",1,6,0,1.7746166417928651E-2,1.5327764213168442E-4,1.3990739287790946E-2,1.0630061115950426E-2,295,0,6742,0,1000,295]
[3400321300,"0211","Elmwood Park borough","Bergen",1,154,0,7.6333818773040036E-3,2.5485457244890544E-3,5.4708988402400295E-3,5.2176088140110299E-3,145,0,7652,0,1000,145]
[3400321450,"0214","Emerson borough","Bergen",1,0,0,3.6822453565632713E-3,7.0274285331049981E-3,8.9143483709943887E-3,6.5413407535542187E-3,181,0,2482,0,496,181]
[3400321480,"0215","Englewood city","Bergen",1,166,0,2.5330986721263476E-2,6.4501074757113523E-3,9.4298946690358904E-3,1.373699628867024E-2,381,0,10909,0,1000,381]
[3400321510,"0216","Englewood Cliffs borough","Bergen",1,0,0,1.7840424649196388E-2,3.5624271217070264E-3,1.4139660411509738E-2,1.1847504060804384E-2,329,0,1846,0,369,329]
[3400322470,"0217","Fair Lawn borough","Bergen",1,65,0,2.1152592875700246E-2,1.5552412197383978E-3,2.1854109300657579E-2,1.4853981132032073E-2,412,0,12243,0,1000,412]
[3400322560,"0218","Fairview borough","Bergen",1,313,0,9.3521273928462989E-3,5.171425001827188E-5,1.0828360352482386E-3,3.4955592260376028E-3,97,0,5021,0,1000,97]
[3400324420,"0219","Fort Lee borough","Bergen",1,241,0,2.2560684956732479E-2,2.2429458799837522E-3,1.6554369140888835E-2,1.3785999992535021E-2,382,0,18451,0,1000,382]
[3400324990,"0220","Franklin Lakes borough","Bergen",1,65,0,5.6582127551300212E-3,3.0361325215422046E-2,1.7772357287291839E-2,1.7930631752614636E-2,497,0,3722,0,744,497]
[3400325770,"0221","Garfield city","Bergen",1,322,1,0,0,0,0,0,0,11773,0,1000,0]
[3400326640,"0222","Glen Rock borough","Bergen",1,0,0,3.4739184341033534E-3,3.3026986600827248E-3,1.7242285023585206E-2,8.0063007059237613E-3,222,0,3934,0,787,222]
[3400328680,"0223","Hackensack city","Bergen",1,593,1,0,0,0,0,0,0,19132,0,1000,0]
[3400330150,"0224","Harrington Park borough","Bergen",1,0,0,2.1562799741695541E-3,8.4063173176978506E-3,1.1257148124146471E-2,7.2732484720046259E-3,202,0,1594,0,319,202]
[3400330420,"0225","Hasbrouck Heights borough","Bergen",1,8,0,7.1165145820270906E-3,1.3071720813141285E-3,7.7123037387730065E-3,5.3786634673714086E-3,149,0,4535,0,907,149]
[3400330540,"0226","Haworth borough","Bergen",1,0,0,2.0395273447864556E-3,1.1648272219987226E-2,1.2436242175625127E-2,8.7080139134662702E-3,242,0,1104,1,221,221]
[3400331920,"0227","Hillsdale borough","Bergen",1,0,0,2.3381322533337001E-3,7.7354358255810191E-3,1.3738375239434325E-2,7.9373144394496806E-3,220,0,3502,0,700,220]
[3400332310,"0228","Ho-Ho-Kus borough","Bergen",1,0,0,9.6652476693737739E-4,6.557668032432384E-3,1.6024425032217498E-2,7.8495392771957533E-3,218,0,1416,0,283,218]
[3400340020,"0229","Leonia borough","Bergen",1,68,0,3.0592041222174179E-3,1.6097746424490588E-3,6.5270379738501926E-3,3.7320055795055564E-3,104,0,3359,0,672,104]
[3400340680,"0230","Little Ferry borough","Bergen",1,114,0,7.9945896889246446E-3,1.7116303543296133E-4,2.5850610247253364E-3,3.5836045830276472E-3,99,0,4351,0,870,99]
[3400341100,"0231","Lodi borough","Bergen",1,140,1,0,0,0,0,0,0,9971,0,1000,0]
[3400342090,"0232","Lyndhurst township","Bergen",1,91,0,2.8489172085031742E-2,8.5894679509231683E-4,1.0225909839334333E-2,1.3191342906486131E-2,366,0,9069,0,1000,366]
[3400342750,"0233","Mahwah township","Bergen",1,36,0,2.908397166489551E-2,2.4908129997586251E-2,1.4011149785841111E-2,2.2667750482774293E-2,629,0,9727,0,1000,629]
[3400344880,"0234","Maywood borough","Bergen",1,12,0,5.8380243504925376E-3,5.9707466508800914E-4,7.7288004411435402E-3,4.721299818908029E-3,131,0,3717,0,743,131]
[3400346110,"0235","Midland Park borough","Bergen",1,0,0,4.042030181017846E-3,3.980401839774968E-3,8.6979187653717354E-3,5.5734502620548507E-3,155,0,2750,0,550,155]
[3400347610,"0236","Montvale borough","Bergen",1,30,0,5.5489521918486804E-3,1.9086439575136546E-2,1.3024012713809969E-2,1.2553134826931732E-2,348,0,3016,0,603,348]
[3400347700,"0237","Moonachie borough","Bergen",1,102,0,1.9651967018471106E-2,1.0083297746430544E-2,2.8343170469164996E-3,1.0856527270606049E-2,301,0,1120,1,224,224]
[3400351660,"0238","New Milford borough","Bergen",1,14,0,2.7094344353473187E-3,1.0545592494750676E-3,8.5195106831005684E-3,4.0945014559743186E-3,114,0,6276,0,1000,114]
[3400352320,"0239","North Arlington borough","Bergen",1,36,0,1.3723894434414918E-2,3.6263989432012401E-3,7.1408938655837216E-3,8.1637290810666254E-3,227,0,6525,0,1000,227]
[3400353430,"0240","Northvale borough","Bergen",1,8,0,5.2803968108840939E-3,1.1165879406913582E-3,5.7480166074614855E-3,4.048333786345646E-3,112,0,1641,0,328,112]
[3400353610,"0241","Norwood borough","Bergen",1,15,0,4.0887947833303205E-3,3.9573239330154405E-3,9.3372535588325169E-3,5.7944574250594254E-3,161,0,1943,0,389,161]
[3400353850,"0242","Oakland borough","Bergen",1,10,0,1.1785082701200662E-2,7.3713850152084502E-3,1.3901876046777808E-2,1.1019447921062306E-2,306,0,4356,0,871,306]
[3400354870,"0243","Old Tappan borough","Bergen",1,4,0,3.2894358549140134E-4,1.2049061396467947E-2,1.2762300083559056E-2,8.380101688506135E-3,233,0,1982,0,396,233]
[3400354990,"0244","Oradell borough","Bergen",1,0,0,4.0680878264122032E-3,1.5453012656788888E-3,1.4509989092449584E-2,6.7077927281802251E-3,186,0,2782,0,556,186]
[3400355770,"0245","Palisades Park borough","Bergen",1,333,0,1.6742653148007911E-2,2.8727574510097579E-4,6.864489360404076E-3,7.9648060845043216E-3,221,0,7314,0,1000,221]
[3400355950,"0246","Paramus borough","Bergen",1,254,0,0.1239947628427699,2.487767817311325E-2,1.5753276884200747E-2,5.4875239300027967E-2,1523,1,8448,1,1000,1000]
[3400356130,"0247","Park Ridge borough","Bergen",1,137,0,7.2089194216322936E-4,2.0610872697599302E-3,1.209772359996774E-2,4.9599009372969663E-3,138,0,3310,0,662,138]
[3400361680,"0248","Ramsey borough","Bergen",1,51,0,1.5971033034420858E-2,2.3438556989289518E-2,1.4983736405369864E-2,1.8131108809693413E-2,503,0,5488,0,1000,503]
[3400362910,"0249","Ridgefield borough","Bergen",1,62,0,1.6647652245247179E-2,1.0116780464501124E-3,6.4405860989952771E-3,8.0333054635641898E-3,223,0,4050,0,810,223]
[3400362940,"0250","Ridgefield Park village","Bergen",1,163,0,7.330128623046178E-3,5.6078831139938555E-4,5.7075301912694852E-3,4.532815708571683E-3,126,0,4986,0,997,126]
[3400363000,"0251","Ridgewood village","Bergen",1,4,0,1.1852405276077112E-2,4.1155471979539004E-3,3.0241324280707159E-2,1.5403092251579389E-2,427,0,8490,0,1000,427]
[3400363360,"0252","River Edge borough","Bergen",1,33,0,3.1442839105431529E-3,1.7916897322537164E-3,1.2282215900548222E-2,5.739396514448364E-3,159,0,4191,0,838,159]
[3400363690,"0253","River Vale township","Bergen",1,49,0,7.3718393194056213E-4,5.8483129549409983E-3,1.4551636954566221E-2,7.0457112804825943E-3,195,0,3536,0,707,195]
[3400363990,"0254","Rochelle Park township","Bergen",1,10,0,6.070060429819662E-3,1.2166156191622798E-4,5.6239937306322967E-3,3.9385719074560626E-3,109,0,2151,0,430,109]
[3400364170,"0255","Rockleigh borough","Bergen",1,0,0,2.541770931152544E-4,2.9067138418077823E-3,9.4111968638565593E-3,4.1906959329265324E-3,116,0,69,1,14,14]
[3400365280,"0256","Rutherford borough","Bergen",1,16,0,1.0631843681691591E-2,1.186448171154753E-3,1.23248357696529E-2,8.0477092074997484E-3,223,0,7061,0,1000,223]
[3400365340,"0257","Saddle Brook township","Bergen",1,42,0,1.7048816017869638E-2,3.1523857671469113E-3,9.9368309416619973E-3,1.0046010908892849E-2,279,0,5378,0,1000,279]
[3400365400,"0258","Saddle River borough","Bergen",1,75,0,1.2989324989697165E-3,3.5804889295489049E-2,1.4074567027076984E-2,1.7059462940511916E-2,473,0,1246,1,249,249]
[3400368970,"0259","South Hackensack township","Bergen",1,7,0,1.6197174437197696E-2,2.9182051156812059E-5,2.6357179564899082E-3,6.2873581482814711E-3,174,0,922,0,184,174]
[3400372360,"0260","Teaneck township","Bergen",1,214,0,1.5069916249844354E-2,1.1295959032794931E-2,2.025395742637822E-2,1.5539944236339169E-2,431,0,13784,0,1000,431]
[3400372420,"0261","Tenafly borough","Bergen",1,68,0,5.5323751263353779E-3,5.4532230541465658E-3,2.1139506573491312E-2,1.0708368251324421E-2,297,0,4913,0,983,297]
[3400372480,"0262","Teterboro borough","Bergen",1,4,0,9.9034106997057322E-3,9.4962555082425557E-5,0,3.3327910849293859E-3,92,0,25,1,5,5]
[3400375140,"0263","Upper Saddle River borough","Bergen",1,0,0,6.1596014864062903E-4,6.5410883567657268E-3,1.8026076335274269E-2,8.3943749468935406E-3,233,0,2658,0,532,233]
[3400376400,"0264","Waldwick borough","Bergen",1,19,0,3.8148301466033115E-3,4.4324600777931062E-3,1.0981194924491813E-2,6.4094950496294103E-3,178,0,3577,0,715,178]
[3400376490,"0265","Wallington borough","Bergen",1,81,0,5.269905210131362E-3,1.0018578802279243E-3,3.6710322100291602E-3,3.3142651001294827E-3,92,0,4825,0,965,92]
[3400377135,"0266","Washington township","Bergen",1,0,0,1.1484114083709501E-3,7.3310414024247194E-3,1.1449316495216421E-2,6.6429231020040296E-3,184,0,3278,0,656,184]
[3400380270,"0267","Westwood borough","Bergen",1,19,0,1.0642899055169528E-2,1.4175042064967979E-3,1.3372647833789501E-2,8.4776836984852746E-3,235,0,4515,0,903,235]
[3400382300,"0268","Woodcliff Lake borough","Bergen",1,0,0,1.3949838460792653E-2,1.7654022056140865E-2,1.6070994402192139E-2,1.589161830637522E-2,441,0,2114,1,423,423]
[3400382570,"0269","Wood-Ridge borough","Bergen",1,17,0,4.2603357449050834E-3,3.1481260890588305E-4,9.504642815020177E-3,4.6932637229437149E-3,130,0,3920,0,784,130]
[3400383050,"0270","Wyckoff township","Bergen",1,40,0,5.7505098540682319E-3,1.6577064383385302E-2,1.9498224147296329E-2,1.3941932794916621E-2,387,0,5569,0,1000,387]
[3400503370,"0301","Bass River township","Burlington",5,30,0,2.49727886754488E-3,0,4.9607928365462328E-3,2.4860239013637041E-3,23,0,520,0,104,23]
[3400505740,"0302","Beverly city","Burlington",5,15,0,3.2140019450781909E-4,7.2286922670634652E-4,5.2035646034830048E-3,2.0826113415657235E-3,19,0,971,0,194,19]
[3400506670,"0303","Bordentown city","Burlington",5,0,0,3.0659592582603086E-3,1.1662666449025871E-4,5.9531393308847602E-3,3.0452417512117757E-3,28,0,1877,0,375,28]
[3400506700,"0304","Bordentown township","Burlington",5,95,0,3.1860354968571453E-2,7.9236319929506544E-3,1.2363160067622806E-2,1.7382382343048303E-2,159,0,4505,0,901,159]
[3400508920,"0305","Burlington city","Burlington",5,63,0,3.1025357836428841E-3,1.7367018223622165E-3,4.9266355747130917E-3,3.2552910602393972E-3,30,0,4004,0,801,30]
[3400508950,"0306","Burlington township","Burlington",5,132,0,4.405841665326634E-2,4.2509690003017811E-2,1.4632297936314376E-2,3.373346819753284E-2,308,0,8419,0,1000,308]
[3400512670,"0307","Chesterfield township","Burlington",5,0,0,9.9417249637328642E-4,1.3108716455928246E-5,1.8773806631887626E-2,6.5936959482389467E-3,60,0,2008,0,402,60]
[3400512940,"0308","Cinnaminson township","Burlington",5,32,0,9.2476039766970792E-3,4.1125889932222852E-3,1.7351144245343071E-2,1.0237112405087479E-2,93,0,6168,0,1000,93]
[3400517080,"0309","Delanco township","Burlington",5,20,0,2.6084578913182044E-3,3.0585383608491396E-3,4.3283811772739404E-3,3.3317924764804281E-3,30,0,2031,0,406,30]
[3400517440,"0310","Delran township","Burlington",5,40,0,1.4253384734118021E-2,4.125625597145949E-3,1.3278796121965121E-2,1.0552602151076363E-2,96,0,6572,0,1000,96]
[3400518790,"0311","Eastampton township","Burlington",5,24,0,1.5109873554616249E-3,1.3978305233803901E-3,8.5822202370605758E-3,3.8303460386341971E-3,35,0,2450,0,490,35]
[3400520050,"0312","Edgewater Park township","Burlington",5,72,0,9.9626748212727941E-3,3.2065931597420987E-3,6.2298493268310995E-3,6.4663724359486641E-3,59,0,3659,0,732,59]
[3400522110,"0313","Evesham township","Burlington",5,111,0,3.9377499873696639E-2,1.102027258963037E-3,3.1779319783157449E-2,2.4086282305272377E-2,220,0,18681,0,1000,220]
[3400523250,"0314","Fieldsboro borough","Burlington",5,0,0,9.6463630100669044E-5,8.7585772389357669E-5,3.9871938309090117E-3,1.3904144111330128E-3,13,0,213,0,43,13]
[3400523850,"0315","Florence township","Burlington",5,42,0,1.4901774785541722E-2,8.9886509623177194E-3,1.1165469731753978E-2,1.1685298493204474E-2,107,0,5061,0,1000,107]
[3400529010,"0316","Hainesport township","Burlington",5,0,0,8.203501048691603E-3,6.0845194075210525E-3,1.0882287672879097E-2,8.3901027096972506E-3,77,0,2276,0,455,77]
[3400542060,"0317","Lumberton township","Burlington",5,38,0,1.16190985309474E-2,1.0557442231138005E-2,1.2748920502065575E-2,1.164182042138366E-2,106,0,4751,0,950,106]
[3400543290,"0318","Mansfield township","Burlington",5,0,0,6.613397251957265E-3,9.9811435203925533E-3,1.0272724879719588E-2,8.9557552173564689E-3,82,0,3544,0,709,82]
[3400543740,"0319","Maple Shade township","Burlington",5,73,0,1.673858446688048E-2,4.766426155430138E-4,8.3755741069323018E-3,8.5302670631186E-3,78,0,8883,0,1000,78]
[3400545120,"0320","Medford township","Burlington",5,69,0,1.4187119538860204E-2,1.3325042463529762E-2,2.8647115813547765E-2,1.8719759271979244E-2,171,0,8959,0,1000,171]
[3400545210,"0321","Medford Lakes borough","Burlington",5,0,0,3.5290454556737916E-4,2.2259456290074776E-6,1.1174575576945286E-2,3.8432353560472238E-3,35,0,1522,0,304,35]
[3400547880,"0322","Moorestown township","Burlington",5,20,0,4.3594215191139672E-2,1.0436970377854621E-2,2.7983765478919502E-2,2.7338317015971263E-2,250,0,7536,0,1000,250]
[3400548900,"0323","Mount Holly township","Burlington",5,42,0,5.1431181924337689E-3,1.703260094548207E-3,6.6079454970718147E-3,4.4847745946845971E-3,41,0,3762,0,752,41]
[3400549020,"0324","Mount Laurel township","Burlington",5,46,0,9.0770768712401931E-2,1.9616741516342899E-2,3.1262288315100709E-2,4.7216599514615175E-2,431,0,18913,0,1000,431]
[3400551510,"0325","New Hanover township","Burlington",5,1,0,6.5841541958912297E-4,0,6.2443646478778691E-3,2.300926689155664E-3,21,0,644,0,129,21]
[3400553070,"0326","North Hanover township","Burlington",5,37,0,3.3808129414944978E-3,0,5.9278028059443176E-3,3.1028719158129382E-3,28,0,2882,0,576,28]
[3400555800,"0327","Palmyra borough","Burlington",5,2,0,1.8005196255705925E-3,1.5433644594644142E-3,6.7408796557455603E-3,3.3615879135935225E-3,31,0,3271,0,654,31]
[3400557480,"0328","Pemberton borough","Burlington",5,0,0,3.4735668331712814E-4,0,4.5242925573397699E-3,1.6238830802189658E-3,15,0,567,0,113,15]
[3400557510,"0329","Pemberton township","Burlington",5,79,0,4.8591535066351919E-3,1.04927658632582E-2,1.0437188938440338E-2,8.5963694361112439E-3,79,0,9933,0,1000,79]
[3400563510,"0330","Riverside township","Burlington",5,126,0,1.1449285792361494E-3,3.024599348921132E-4,4.4819855186123293E-3,1.9764580109135304E-3,18,0,2910,0,582,18]
[3400563660,"0331","Riverton borough","Burlington",5,0,0,1.1616583788446333E-3,5.5848036956495432E-5,8.5886038159593558E-3,3.268703410586828E-3,30,0,1040,0,208,30]
[3400566810,"0332","Shamong township","Burlington",5,0,0,1.3017524837590556E-3,4.8558242748507845E-4,1.0036274563113607E-2,3.9412031581192468E-3,36,0,2209,0,442,36]
[3400568610,"0333","Southampton township","Burlington",5,33,0,6.6815033692741973E-3,3.3082146051070907E-4,7.4692367757742077E-3,4.8271872018530379E-3,44,0,4654,0,931,44]
[3400569990,"0334","Springfield township","Burlington",5,2,0,2.4690459858395116E-3,0,1.0536888176376961E-2,4.335311387405491E-3,40,0,1168,0,234,40]
[3400572060,"0335","Tabernacle township","Burlington",5,0,0,1.6618849194217397E-3,1.747383659936347E-3,8.8529846772128287E-3,4.0874177521903051E-3,37,0,2421,0,484,37]
[3400577150,"0336","Washington township","Burlington",5,0,0,9.0038560635762152E-4,0,3.499153501875451E-3,1.466513036077691E-3,13,0,284,0,57,13]
[3400578200,"0337","Westampton township","Burlington",5,0,0,2.1519606902115806E-2,2.1498767732720123E-2,1.12909219700883E-2,1.8103098868308076E-2,165,0,3277,0,655,165]
[3400581440,"0338","Willingboro township","Burlington",5,16,0,8.9064336867354637E-3,2.1827011878600942E-3,1.4184289434271861E-2,8.4244747696224729E-3,77,0,11231,0,1000,77]
[3400582420,"0339","Woodland township","Burlington",5,4,0,5.1207028189092835E-4,0,1.0024834102850834E-2,3.5123014615805873E-3,32,0,469,0,94,32]
[3400582960,"0340","Wrightstown borough","Burlington",5,17,0,7.3655480156174151E-4,1.6508319942297564E-3,1.4470852467664457E-3,1.2781573475193146E-3,12,0,315,0,63,12]
[3400702200,"0401","Audubon borough","Camden",5,0,0,4.1204862258185995E-3,1.7319233684587798E-4,9.4563612033687818E-3,4.5833465886777535E-3,42,0,3623,0,725,42]
[3400702230,"0402","Audubon Park borough","Camden",5,4,0,0,0,1.3917978155951424E-3,4.6393260519838079E-4,4,0,490,0,98,4]
[3400703250,"0403","Barrington borough","Camden",5,34,0,3.3320343937339896E-3,8.232779578854195E-4,6.4976875801793623E-3,3.5509999772662571E-3,32,0,3197,0,639,32]
[3400704750,"0404","Bellmawr borough","Camden",5,74,0,7.2527478291878836E-3,8.5588331398460599E-4,5.98546319827503E-3,4.6980314471491728E-3,43,0,4779,0,956,43]
[3400705440,"0405","Berlin borough","Camden",5,15,0,4.9096242830472762E-3,7.2346969273874226E-3,8.2523845699921539E-3,6.7989019268089512E-3,62,0,2858,0,572,62]
[3400705470,"0406","Berlin township","Camden",5,60,0,1.2730810489467802E-2,8.7561354797326078E-3,6.2684451486614981E-3,9.2517970392873017E-3,84,0,2298,0,460,84]
[3400708170,"0407","Brooklawn borough","Camden",5,7,0,2.0128901724289624E-3,1.5991776883069283E-4,2.1438479455400776E-3,1.4388852955999111E-3,13,0,734,0,147,13]
[3400710000,"0408","Camden city","Camden",5,1342,1,0,0,0,0,0,0,24385,0,1000,0]
[3400712280,"0409","Cherry Hill township","Camden",5,378,0,0.12319540661816022,1.7338673395080439E-2,4.7194929943579593E-2,6.2576336652273426E-2,571,0,28258,0,1000,571]
[3400712550,"0410","Chesilhurst borough","Camden",5,0,0,2.8022367553483664E-4,6.9799228753848908E-3,4.42474968801928E-3,3.8949654129796694E-3,36,0,570,0,114,36]
[3400713420,"0411","Clementon borough","Camden",5,0,0,1.1935743459518099E-3,2.0165490067120756E-3,3.2620981635916799E-3,2.1574071720851886E-3,20,0,2207,0,441,20]
[3400714260,"0412","Collingswood borough","Camden",5,10,0,5.4745849778518275E-3,2.4989678569548141E-5,8.5618883322328559E-3,4.6871543295514103E-3,43,0,6455,0,1000,43]
[3400726070,"0413","Gibbsboro borough","Camden",5,14,0,1.6963496950058886E-3,8.2826653418624652E-3,5.4450352060894181E-3,5.1413500809859231E-3,47,0,795,0,159,47]
[3400726760,"0415","Gloucester township","Camden",5,221,0,3.5020016637413942E-2,4.5960191618513772E-2,3.0346695427584114E-2,3.7108967894503943E-2,339,0,25033,0,1000,339]
[3400726820,"0414","Gloucester City","Camden",5,7,0,4.0011673883329768E-3,6.201719205828442E-4,5.4687356414183531E-3,3.3633583167780577E-3,31,0,4111,0,822,31]
[3400728740,"0416","Haddon township","Camden",5,35,0,6.7304343297314344E-3,3.728319081306635E-4,1.5453725669927828E-2,7.5189973025966417E-3,69,0,6623,0,1000,69]
[3400728770,"0417","Haddonfield borough","Camden",5,35,0,8.1189143948084217E-3,2.6856664576135029E-4,2.2276227468865768E-2,1.0221236169811847E-2,93,0,4410,0,882,93]
[3400728800,"0418","Haddon Heights borough","Camden",5,30,0,2.6389031292524418E-3,2.3923125215852178E-4,1.1167053811088233E-2,4.6817293974997327E-3,43,0,3009,0,602,43]
[3400732220,"0419","Hi-Nella borough","Camden",5,5,0,1.3402639430037038E-4,2.5715299211184555E-4,2.5236735230818211E-3,9.7161763649801231E-4,9,0,386,0,77,9]
[3400739210,"0420","Laurel Springs borough","Camden",5,0,0,1.4556210233376146E-4,9.9198730312638226E-5,7.2558253980309602E-3,2.5001954102257867E-3,23,0,748,0,150,23]
[3400739420,"0421","Lawnside borough","Camden",5,29,0,2.798835242919441E-3,4.6913626092866872E-3,3.8876073489891743E-3,3.7926017337317677E-3,35,0,1148,0,230,35]
[3400740440,"0422","Lindenwold borough","Camden",5,293,1,0,0,0,0,0,0,9134,0,1000,0]
[3400742630,"0423","Magnolia borough","Camden",5,0,0,2.3837753164777805E-3,5.8714083237972634E-4,4.3226232357846577E-3,2.4311797948807215E-3,22,0,1776,0,355,22]
[3400745510,"0424","Merchantville borough","Camden",5,15,0,9.5617916725429227E-4,0,3.9057501888620297E-3,1.6206431187054408E-3,15,0,1562,0,312,15]
[3400748750,"0425","Mount Ephraim borough","Camden",5,40,0,1.7743489968244125E-3,2.3533819346684907E-4,5.2701634956703125E-3,2.4266168953205247E-3,22,0,1941,0,388,22]
[3400753880,"0426","Oaklyn borough","Camden",5,31,0,7.8040023715259237E-4,6.858385129577151E-5,5.0403181846496396E-3,1.9631007576993344E-3,18,0,1759,0,352,18]
[3400757660,"0427","Pennsauken township","Camden",5,392,1,0,0,0,0,0,0,13145,0,1000,0]
[3400758770,"0428","Pine Hill borough","Camden",5,53,0,1.5872402643187214E-3,1.8929577494493522E-2,5.2931694323415778E-3,8.6033290637179405E-3,79,0,4408,0,882,79]
[3400765160,"0430","Runnemede borough","Camden",5,59,0,4.6268909253315256E-3,1.299514045905935E-3,6.824749612117916E-3,4.2503848611184589E-3,39,0,3374,0,675,39]
[3400768340,"0431","Somerdale borough","Camden",5,5,0,3.2901423175523978E-3,8.684315877933367E-4,5.8051913206859677E-3,3.3212550753439012E-3,30,0,2290,0,458,30]
[3400771220,"0432","Stratford borough","Camden",5,10,0,1.2080703179869489E-3,2.4630645612031964E-4,6.7889489764287724E-3,2.7477752501786803E-3,25,0,2680,0,536,25]
[3400772240,"0433","Tavistock borough","Camden",5,0,0,7.6429813174357119E-4,0,1.7508109660121049E-2,6.0908025972882069E-3,56,0,2,1,0,0]
[3400776220,"0434","Voorhees township","Camden",5,289,0,3.1723607250504986E-2,1.4597901751319029E-2,2.12811711450035E-2,2.2534226715609174E-2,206,0,11989,0,1000,206]
[3400777630,"0435","Waterford township","Camden",5,10,0,2.090275957204991E-3,5.5091790507237875E-3,9.5111444993075459E-3,5.7035331690787755E-3,52,0,3796,0,759,52]
[3400781740,"0436","Winslow township","Camden",5,132,0,1.6111333673390116E-2,6.2571765434940987E-2,1.7322222235430708E-2,3.2001773781253934E-2,292,0,14498,0,1000,292]
[3400782450,"0437","Woodlynne borough","Camden",5,7,0,2.3775141080188656E-4,5.258318984037488E-5,3.086064739951668E-3,1.125466446864643E-3,10,0,902,0,180,10]
[3400902320,"0501","Avalon borough","Cape May",6,0,0,2.6420169202129376E-2,0,2.2211210037313169E-2,1.6210459746480849E-2,31,0,633,0,127,31]
[3400910270,"0502","Cape May city","Cape May",6,46,0,6.7196574685627758E-2,0,8.2973748185039137E-3,2.5164649834710558E-2,48,0,1382,0,276,48]
[3400910330,"0503","Cape May Point borough","Cape May",6,0,0,-5.674712091078852E-5,0,7.6734137280563023E-3,2.5388888690485046E-3,5,0,152,0,30,5]
[3400917560,"0504","Dennis township","Cape May",6,0,0,2.8345699364251714E-2,3.012626122939315E-3,2.1517648558336201E-2,1.762532468184241E-2,33,0,2360,0,472,33]
[3400941610,"0505","Lower township","Cape May",6,75,0,4.2446740253263927E-2,1.5317831238552512E-2,3.0730290601428931E-2,2.9498287364415121E-2,56,0,9445,0,1000,56]
[3400945810,"0506","Middle township","Cape May",6,51,0,7.2269237715291923E-2,2.5821836184366162E-2,3.0807185256884612E-2,4.2966086385514225E-2,81,0,8099,0,1000,81]
[3400953490,"0507","North Wildwood city","Cape May",6,39,0,2.8917659423631805E-2,0,1.2366213998234638E-2,1.3761291140622148E-2,26,0,1922,0,384,26]
[3400954360,"0508","Ocean City","Cape May",6,160,0,7.8153856061592905E-2,0,3.0072268383756942E-2,3.6075374815116613E-2,68,0,5454,0,1000,68]
[3400966390,"0509","Sea Isle City","Cape May",6,0,0,2.7061577131069842E-2,0,1.2247612688049948E-2,1.3103063273039931E-2,25,0,1098,0,220,25]
[3400971010,"0510","Stone Harbor borough","Cape May",6,0,0,2.4574384948034749E-2,0,1.6699737156231128E-2,1.375804070142196E-2,26,0,402,0,80,26]
[3400974810,"0511","Upper township","Cape May",6,0,0,2.7442176458476037E-2,1.5410780750476388E-2,3.2233162146841535E-2,2.502870645193132E-2,47,0,4818,0,964,47]
[3400978530,"0512","West Cape May borough","Cape May",6,0,0,7.8296886722393107E-3,0,9.3673308592785234E-3,5.7323398438392783E-3,11,0,500,0,100,11]
[3400980210,"0513","West Wildwood borough","Cape May",6,8,0,1.3559505980059463E-3,0,4.4290617382627823E-3,1.9283374454229097E-3,4,0,262,0,52,4]
[3400981170,"0514","Wildwood city","Cape May",6,15,0,7.0329008461680137E-2,0,5.2884578172565123E-3,2.5205822092978881E-2,48,0,2285,0,457,48]
[3400981200,"0515","Wildwood Crest borough","Cape May",6,10,0,3.1602322264838827E-2,0,8.348684554612254E-3,1.331700227315036E-2,25,0,1473,0,295,25]
[3400981890,"0516","Woodbine borough","Cape May",6,27,0,2.4316100670174158E-3,3.807690293647753E-2,2.1335063579566447E-3,1.4214006453817195E-2,27,0,727,0,145,27]
[3401107600,"0601","Bridgeton city","Cumberland",6,290,1,0,0,0,0,0,0,6636,0,1000,0]
[3401114710,"0602","Commercial township","Cumberland",6,2,0,1.4798295540727681E-3,7.4953382258175424E-3,5.9985213168495064E-3,4.9912296989132725E-3,9,0,1776,0,355,9]
[3401116900,"0603","Deerfield township","Cumberland",6,3,0,2.3562230950446607E-3,0,9.5631247382645182E-3,3.973115944436393E-3,8,0,1103,0,221,8]
[3401118220,"0604","Downe township","Cumberland",6,4,0,3.4215933085508704E-5,0,5.3822080796277812E-3,1.8054746709044299E-3,3,0,586,0,117,3]
[3401122350,"0605","Fairfield township","Cumberland",6,35,0,2.5485054967846052E-3,5.006740242923309E-2,6.8867997188340017E-3,1.9834235881617233E-2,37,0,1761,0,352,37]
[3401128170,"0606","Greenwich township","Cumberland",6,4,0,9.5258183084383959E-5,0,1.0246084044631298E-2,3.4471140759052272E-3,7,0,313,0,63,7]
[3401133120,"0607","Hopewell township","Cumberland",6,31,0,4.9557768544902904E-3,8.7826860652644528E-2,1.3421078184989211E-2,3.5401238564041343E-2,67,0,1644,0,329,67]
[3401139450,"0608","Lawrence township","Cumberland",6,17,0,5.8453505512351346E-4,0,1.1045705343129864E-2,3.8767467994177927E-3,7,0,1068,0,214,7]
[3401144580,"0609","Maurice River township","Cumberland",6,0,0,3.3653454340908276E-3,7.7739484725954848E-4,8.1483802657624609E-3,4.0970401823709453E-3,8,0,1257,0,251,8]
[3401146680,"0610","Millville city","Cumberland",6,132,0,3.9388038271296201E-2,0.12090852414790043,2.7222878847315914E-2,6.2506480422170843E-2,118,0,10770,0,1000,118]
[3401167020,"0611","Shiloh borough","Cumberland",6,0,0,1.6808549881870409E-4,0,8.5261140604707998E-3,2.8980665197631678E-3,5,0,196,0,39,5]
[3401171160,"0612","Stow Creek township","Cumberland",6,4,0,3.5375270485301551E-4,0,1.1564801758235679E-2,3.972851487696231E-3,8,0,522,0,104,8]
[3401174870,"0613","Upper Deerfield township","Cumberland",6,31,0,1.6130094897343423E-2,0.15750997460083582,1.3177190368119807E-2,6.2272419955433027E-2,118,0,2841,0,568,118]
[3401176070,"0614","Vineland city","Cumberland",6,276,1,0,0,0,0,0,0,22176,0,1000,0]
[3401304695,"0701","Belleville township","Essex",2,324,1,0,0,0,0,0,0,14282,0,1000,0]
[3401306260,"0702","Bloomfield township","Essex",2,329,1,0,0,0,0,0,0,20810,0,1000,0]
[3401309250,"0703","Caldwell borough","Essex",2,57,0,3.8131194229122051E-3,1.0620512656096393E-4,7.5925928630516393E-3,3.8373058041749363E-3,79,0,3538,0,708,79]
[3401311200,"0704","Cedar Grove township","Essex",2,15,0,7.3919350476772021E-3,4.5607270689914338E-3,1.2881136140856522E-2,8.2779327525083855E-3,170,0,4754,0,951,170]
[3401313045,"0717","City of Orange township","Essex",2,678,1,0,0,0,0,0,0,12788,0,1000,0]
[3401319390,"0705","East Orange city","Essex",2,1850,1,0,0,0,0,0,0,27410,0,1000,0]
[3401321840,"0706","Essex Fells borough","Essex",2,0,0,2.1082418704570984E-4,3.9868878832598304E-3,1.3921310301744148E-2,6.0396741240165627E-3,124,0,750,0,150,124]
[3401322385,"0707","Fairfield township","Essex",2,0,0,4.9027913161084936E-2,1.0039860421755965E-2,6.2787315363619029E-3,2.1782168373067606E-2,447,0,2747,0,549,447]
[3401326610,"0708","Glen Ridge borough","Essex",2,0,0,7.785306479448962E-3,4.739902556919889E-5,1.8283315106806905E-2,8.7053402039416888E-3,178,0,2529,0,506,178]
[3401334450,"0709","Irvington township","Essex",2,1404,1,0,0,0,0,0,0,22638,0,1000,0]
[3401340890,"0710","Livingston township","Essex",2,0,0,2.6867386674383497E-2,1.0617130388015194E-2,2.9955697461873178E-2,2.2480071508090626E-2,461,0,10337,0,1000,461]
[3401343800,"0711","Maplewood township","Essex",2,20,0,1.1408760596899627E-2,2.9501570776262735E-4,1.9884925107528328E-2,1.0529567137396861E-2,216,0,8866,0,1000,216]
[3401346380,"0712","Millburn township","Essex",2,0,0,4.6010579314086857E-2,4.6279604577831018E-3,3.0584345137021733E-2,2.7074294969630566E-2,555,0,6908,0,1000,555]
[3401347500,"0713","Montclair township","Essex",2,132,1,0,0,0,0,0,0,15555,0,1000,0]
[3401351000,"0714","Newark city","Essex",2,4630,1,0,0,0,0,0,0,108789,0,1000,0]
[3401352620,"0715","North Caldwell borough","Essex",2,0,0,5.6622070709142186E-4,1.834213423848652E-3,1.4868327162420515E-2,5.7562537644535302E-3,118,0,2258,0,452,118]
[3401353680,"0716","Nutley township","Essex",2,85,1,0,0,0,0,0,0,11887,0,1000,0]
[3401364590,"0718","Roseland borough","Essex",2,0,0,7.1695523164035588E-3,6.9851012818006909E-3,8.1291656191647809E-3,7.4279397391230099E-3,152,0,2523,0,505,152]
[3401369274,"0719","South Orange Village township","Essex",2,20,0,6.3938527693279132E-3,3.3917239712023643E-4,1.7131141791892932E-2,7.954722319447027E-3,163,0,5940,0,1000,163]
[3401375815,"0720","Verona township","Essex",2,0,0,6.5278871737864865E-3,4.4595916377117946E-3,1.4316471879039207E-2,8.4346502301791623E-3,173,0,5862,0,1000,173]
[3401378510,"0721","West Caldwell township","Essex",2,4,0,2.2153547228085109E-2,6.0992333473772978E-3,1.152224274930708E-2,1.3258341108256494E-2,272,0,4004,0,801,272]
[3401379800,"0722","West Orange township","Essex",2,409,0,2.1984867955015971E-2,5.1722061081772672E-2,2.2838765466546524E-2,3.2181898167778389E-2,660,0,17738,0,1000,660]
[3401513360,"0801","Clayton borough","Gloucester",5,1,0,2.211372158731639E-3,1.1310429337607538E-2,7.6763916264498723E-3,7.0660643742630159E-3,65,0,3229,0,646,65]
[3401517710,"0802","Deptford township","Gloucester",5,87,0,3.9066925875505532E-2,7.5723946501809788E-2,1.5886086852169943E-2,4.3558986409828422E-2,398,0,12490,0,1000,398]
[3401519180,"0803","East Greenwich township","Gloucester",5,0,0,3.7388349536802601E-3,3.1325024451524207E-2,1.5321873991830694E-2,1.6795244465678389E-2,153,0,3933,0,787,153]
[3401521060,"0804","Elk township","Gloucester",5,17,0,1.8602838040644824E-3,5.6712800274262599E-2,1.1712806345984273E-2,2.3428630141437118E-2,214,0,1587,0,317,214]
[3401524840,"0805","Franklin township","Gloucester",5,48,0,5.4359976831873207E-3,6.7116032240593607E-2,1.0720703408054956E-2,2.7757577777278625E-2,253,0,5904,0,1000,253]
[3401526340,"0806","Glassboro borough","Gloucester",5,121,1,0,0,0,0,0,0,6859,0,1000,0]
[3401528185,"0807","Greenwich township","Gloucester",5,18,0,8.1534916537844386E-3,1.8691810175051501E-2,6.3085952645847883E-3,1.1051299031140244E-2,101,0,1975,0,395,101]
[3401530180,"0808","Harrison township","Gloucester",5,40,0,7.6295482962872238E-3,7.1400917976758238E-2,2.1371218937337389E-2,3.3467228403460954E-2,306,0,4433,0,887,306]
[3401541160,"0809","Logan township","Gloucester",5,0,0,8.5707615773443491E-2,2.8439968921231372E-2,8.7839973167906024E-3,4.0977194003821826E-2,374,0,2097,0,419,374]
[3401543440,"0810","Mantua township","Gloucester",5,21,0,1.0198717224311211E-2,2.2189517744770095E-2,1.3234117284160515E-2,1.5207450751080607E-2,139,0,5942,0,1000,139]
[3401547250,"0811","Monroe township","Gloucester",5,50,0,1.8155825114153989E-2,6.122393485499366E-2,2.0130684262273345E-2,3.3170148077140332E-2,303,0,13707,0,1000,303]
[3401549680,"0812","National Park borough","Gloucester",5,10,0,2.7892949637743565E-4,7.6073974760431295E-4,4.712783150705566E-3,1.9174841315624384E-3,18,0,1127,0,225,18]
[3401551390,"0813","Newfield borough","Gloucester",5,0,0,3.6638929644815E-4,0,6.2606827731678969E-3,2.2090240232053491E-3,20,0,651,0,130,20]
[3401557150,"0814","Paulsboro borough","Gloucester",5,130,0,1.2216591923194112E-3,1.3380760579712438E-3,2.7735649342344225E-3,1.7777667281750258E-3,16,0,2315,0,463,16]
[3401559070,"0815","Pitman borough","Gloucester",5,55,0,4.3967936328715004E-4,2.5769034532339948E-3,8.1287968225490503E-3,3.7151265463567316E-3,34,0,3410,0,682,34]
[3401569030,"0816","South Harrison township","Gloucester",5,14,0,2.5305784312922562E-3,7.2805045218447305E-5,9.2083808958948066E-3,3.9372547908018366E-3,36,0,1104,0,221,36]
[3401571850,"0817","Swedesboro borough","Gloucester",5,5,0,1.8856325209959024E-3,1.1209944898546756E-3,5.4863584953782378E-3,2.8309951687429387E-3,26,0,953,0,191,26]
[3401577180,"0818","Washington township","Gloucester",5,157,0,4.7218135498824768E-2,4.3582153361425353E-2,2.8207326658048325E-2,3.9669205172766155E-2,362,0,17696,0,1000,362]
[3401578110,"0819","Wenonah borough","Gloucester",5,0,0,2.7553932613679519E-4,4.5116082496674345E-4,8.720720469330364E-3,3.1491402068113006E-3,29,0,845,0,169,29]
[3401578800,"0820","West Deptford township","Gloucester",5,42,0,2.6563256039505937E-2,4.7059601654292071E-2,1.1737290370627668E-2,2.845338268814189E-2,260,0,9199,0,1000,260]
[3401580120,"0821","Westville borough","Gloucester",5,16,0,2.0423922754968069E-3,2.2308027070027945E-4,3.102225215100281E-3,1.7892325870991225E-3,16,0,1754,0,351,16]
[3401582120,"0822","Woodbury city","Gloucester",5,147,1,0,0,0,0,0,0,4068,0,814,0]
[3401582180,"0823","Woodbury Heights borough","Gloucester",5,15,0,2.3535530719338916E-3,1.8709595329440523E-3,7.7091447213889497E-3,3.977885775422298E-3,36,0,1095,0,219,36]
[3401582840,"0824","Woolwich township","Gloucester",5,16,0,6.2209807175091269E-3,5.5111625451966607E-2,1.782463472629376E-2,2.6385746965256501E-2,241,0,4098,0,820,241]
[3401703580,"0901","Bayonne city","Hudson",1,749,1,0,0,0,0,0,0,27867,0,1000,0]
[3401719360,"0902","East Newark borough","Hudson",1,31,0,1.5542603266794472E-3,0,8.4117689297042364E-4,7.9847907321662357E-4,22,0,889,0,178,22]
[3401728650,"0903","Guttenberg town","Hudson",1,116,0,2.8576277570995343E-3,0,3.2485229520801489E-3,2.0353835697265611E-3,56,0,4920,0,984,56]
[3401730210,"0904","Harrison town","Hudson",1,257,1,0,0,0,0,0,0,8111,0,1000,0]
[3401732250,"0905","Hoboken city","Hudson",1,126,1,0,0,0,0,0,0,28175,0,1000,0]
[3401736000,"0906","Jersey City","Hudson",1,3733,1,0,0,0,0,0,0,119517,0,1000,0]
[3401736510,"0907","Kearny town","Hudson",1,630,1,0,0,0,0,0,0,14639,0,1000,0]
[3401752470,"0908","North Bergen township","Hudson",1,596,1,0,0,0,0,0,0,23426,0,1000,0]
[3401766570,"0909","Secaucus town","Hudson",1,25,0,6.9500523016321036E-2,5.4478083975139167E-2,1.4593042948648145E-2,4.6190549980036112E-2,1282,1,8840,1,1000,1000]
[3401774630,"0910","Union City","Hudson",1,2088,1,0,0,0,0,0,0,24511,0,1000,0]
[3401777930,"0911","Weehawken township","Hudson",1,84,1,0,0,0,0,0,0,7969,0,1000,0]
[3401779610,"0912","West New York town","Hudson",1,1173,1,0,0,0,0,0,0,20544,0,1000,0]
[3401900550,"1001","Alexandria township","Hunterdon",3,0,0,4.6742017992243542E-4,6.7518776117265981E-3,1.2160045752169087E-2,6.4597811812727064E-3,75,0,1751,0,350,75]
[3401905650,"1002","Bethlehem township","Hunterdon",3,0,0,4.8248963828199828E-4,0,1.2823188626857232E-2,4.4352260883797432E-3,51,0,1347,0,269,51]
[3401906370,"1003","Bloomsbury borough","Hunterdon",3,0,0,5.282993048843068E-4,0,3.2323285276128631E-3,1.2535426108323899E-3,15,0,340,0,68,15]
[3401909280,"1004","Califon borough","Hunterdon",3,0,0,3.4324394710952825E-4,0,5.6183356056646663E-3,1.9871931842580649E-3,23,0,404,0,81,23]
[3401913720,"1005","Clinton town","Hunterdon",3,3,0,1.5006083410850097E-3,2.3808242073435058E-3,1.0018181546092778E-2,4.6332046981737646E-3,54,0,1114,0,223,54]
[3401913750,"1006","Clinton township","Hunterdon",3,0,0,3.830996658233621E-3,2.242900562444762E-2,1.8824017958031947E-2,1.5028006746904396E-2,174,0,4658,0,932,174]
[3401917170,"1007","Delaware township","Hunterdon",3,0,0,6.4239998522210376E-4,0,1.4856724264794811E-2,5.1663747500056379E-3,60,0,1795,0,359,60]
[3401918820,"1008","East Amwell township","Hunterdon",3,4,0,2.7715589298264636E-3,3.8549860325126115E-5,8.5034966603003848E-3,3.7712018168173252E-3,44,0,1548,0,310,44]
[3401923700,"1009","Flemington borough","Hunterdon",3,74,0,2.3469446517790232E-3,2.2918429086176068E-4,4.0017571511960955E-3,2.1926286979456265E-3,25,0,1853,0,371,25]
[3401924870,"1010","Franklin township","Hunterdon",3,0,0,3.9107251737310254E-4,1.0740837559991402E-3,1.1882239679035534E-2,4.4491319841359249E-3,52,0,1172,0,234,52]
[3401925350,"1011","Frenchtown borough","Hunterdon",3,11,0,6.956657736113443E-4,0,4.9213936280065517E-3,1.8723531338726319E-3,22,0,629,0,126,22]
[3401926550,"1012","Glen Gardner borough","Hunterdon",3,10,0,1.158638478826159E-4,0,2.6616613624867859E-3,9.2584173678980067E-4,11,0,785,0,157,11]
[3401929460,"1013","Hampton borough","Hunterdon",3,0,0,1.0916082098863919E-4,0,2.0953799607001575E-3,7.3484692722959892E-4,9,0,612,0,122,9]
[3401931320,"1014","High Bridge borough","Hunterdon",3,4,0,8.6907885553148432E-4,1.1543708481800842E-3,6.4456194447881972E-3,2.823023049499922E-3,33,0,1424,0,285,33]
[3401932460,"1015","Holland township","Hunterdon",3,0,0,-9.1170982128488029E-5,1.7208940762567164E-3,9.4567247276900763E-3,3.695482607272768E-3,43,0,2001,0,400,43]
[3401937065,"1016","Kingwood township","Hunterdon",3,20,0,1.1703222018354267E-3,0,1.1884719681508355E-2,4.3516806277812603E-3,50,0,1476,0,295,50]
[3401938610,"1017","Lambertville city","Hunterdon",3,0,0,3.6730528190626107E-3,0,6.4522934640684985E-3,3.3751154277103699E-3,39,0,2093,0,419,39]
[3401939630,"1018","Lebanon borough","Hunterdon",3,7,0,1.6042356342528413E-3,4.5428066937601132E-4,5.8951950178086493E-3,2.6512371071458342E-3,31,0,795,0,159,31]
[3401939660,"1019","Lebanon township","Hunterdon",3,0,0,9.8176027156033968E-4,0,1.0910512654156235E-2,3.9640909752388584E-3,46,0,2368,0,474,46]
[3401946260,"1020","Milford borough","Hunterdon",3,3,0,-2.8703138423283233E-4,2.458101060566252E-3,3.7282347094518891E-3,1.9664347952617696E-3,23,0,524,0,105,23]
[3401961920,"1021","Raritan township","Hunterdon",3,44,0,2.720624182651904E-2,3.3777999999193571E-2,2.5890401231529914E-2,2.8958214352414174E-2,336,0,8613,0,1000,336]
[3401962250,"1022","Readington township","Hunterdon",3,45,0,6.6997150656715422E-3,0.12000378191008419,1.8432389534060512E-2,4.837862883660541E-2,561,0,6271,0,1000,561]
[3401970980,"1023","Stockton borough","Hunterdon",3,0,0,2.6478760581557137E-4,0,4.801412065594147E-3,1.6887332238032394E-3,20,0,233,0,47,20]
[3401972510,"1024","Tewksbury township","Hunterdon",3,0,0,1.1442409682899249E-3,1.036162217761446E-3,1.7417293285559944E-2,6.5325654905371046E-3,76,0,2185,0,437,76]
[3401974420,"1025","Union township","Hunterdon",3,0,0,1.3936427913344171E-3,2.0113211637101988E-2,8.9211453585596248E-3,1.0142666595665343E-2,118,0,1840,0,368,118]
[3401978230,"1026","West Amwell township","Hunterdon",3,0,0,1.2446455890955442E-3,0,8.9582215380203112E-3,3.4009557090386184E-3,39,0,1147,0,229,39]
[3402119780,"1101","East Windsor township","Mercer",4,166,0,2.2753725067196709E-2,4.2886350584571492E-2,1.4234167037992122E-2,2.6624747563253438E-2,368,0,11158,0,1000,368]
[3402122185,"1102","Ewing township","Mercer",4,99,0,2.9315364011360312E-2,2.9286452557980916E-2,1.0561116319528894E-2,2.3054310962956709E-2,319,0,13889,0,1000,319]
[3402129310,"1103","Hamilton township","Mercer",4,186,0,6.8487057109785823E-2,2.4051214101358329E-2,2.6012359481607777E-2,3.9516876897583979E-2,546,0,36125,0,1000,546]
[3402131620,"1104","Hightstown borough","Mercer",4,47,0,1.6103106172913587E-3,1.2077086042113219E-4,5.8084668334507502E-3,2.5131827703877472E-3,35,0,2097,0,419,35]
[3402133150,"1105","Hopewell borough","Mercer",4,0,0,8.9843148072399153E-4,0,7.5665225443944072E-3,2.8216513417061331E-3,39,0,787,0,157,39]
[3402133180,"1106","Hopewell township","Mercer",4,8,0,2.8476214186242885E-2,6.9020061221597706E-2,2.0466599880752147E-2,3.9320958429530907E-2,543,0,6367,0,1000,543]
[3402139510,"1107","Lawrence township","Mercer",4,68,0,3.6744374929335341E-2,1.4659427919197247E-2,1.8065054532185754E-2,2.3156285793572779E-2,320,0,12550,0,1000,320]
[3402157600,"1108","Pennington borough","Mercer",4,4,0,1.680713997212868E-3,1.9571819761569038E-4,1.0637141501997006E-2,4.1711912322751881E-3,58,0,1028,0,206,58]
[3402160900,"1114","Princeton","Mercer",4,60,0,2.084963101266411E-2,1.3519511732308333E-2,2.5555691800554246E-2,1.9974944848508897E-2,276,0,9373,0,1000,276]
[3402163850,"1112","Robbinsville township","Mercer",4,40,0,2.5890877815178886E-2,2.9540902933042502E-2,1.7578940031795401E-2,2.4336906926672262E-2,336,0,5479,0,1000,336]
[3402174000,"1111","Trenton city","Mercer",4,1084,1,0,0,0,0,0,0,30139,0,1000,0]
[3402180240,"1113","West Windsor township","Mercer",4,61,0,4.4161241152337542E-2,6.8723654923568744E-2,3.0611196828007101E-2,4.7832030967971138E-2,661,0,10369,0,1000,661]
[3402310750,"1201","Carteret borough","Middlesex",3,164,1,0,0,0,0,0,0,8387,0,1000,0]
[3402315550,"1202","Cranbury township","Middlesex",3,0,0,4.4757875481688553E-2,1.8230430281075048E-2,1.8164751169521619E-2,2.7051018977428409E-2,314,0,1323,1,265,265]
[3402318490,"1203","Dunellen borough","Middlesex",3,79,0,1.3932142646668276E-3,7.8250409601511567E-5,4.4661906782782765E-3,1.9792184508488717E-3,23,0,2620,0,524,23]
[3402319000,"1204","East Brunswick township","Middlesex",3,170,0,3.0858434758824702E-2,1.6922054743816469E-2,3.3380454436747399E-2,2.7053647979796192E-2,314,0,17302,0,1000,314]
[3402320230,"1205","Edison township","Middlesex",3,637,0,0.1280332771143487,1.3043591000049256E-2,4.6943485296649268E-2,6.2673451137015737E-2,727,0,36852,0,1000,727]
[3402330840,"1206","Helmetta borough","Middlesex",3,3,0,8.3122832052059001E-5,4.1623828867517598E-4,5.8352862867233025E-3,2.1115491358168459E-3,24,0,1052,0,210,24]
[3402331470,"1207","Highland Park borough","Middlesex",3,209,0,2.4742540189391228E-3,7.58714971078268E-4,8.3090693572888535E-3,3.8473461157687481E-3,45,0,6320,0,1000,45]
[3402334890,"1208","Jamesburg borough","Middlesex",3,19,0,1.6729794906593578E-3,2.8649799242061973E-4,7.9582035969495424E-3,3.3058936933431731E-3,38,0,2115,0,423,38]
[3402345690,"1210","Metuchen borough","Middlesex",3,5,0,1.0733811888934136E-2,8.0302054874147434E-4,1.9490017071984896E-2,1.0342283169886834E-2,120,0,5822,0,1000,120]
[3402345900,"1211","Middlesex borough","Middlesex",3,14,0,1.0748715895225958E-2,9.0782524363094757E-4,9.2687126525450129E-3,6.9750845971339737E-3,81,0,5302,0,1000,81]
[3402346620,"1212","Milltown borough","Middlesex",3,13,0,2.2825599556077682E-3,5.8921593135527451E-4,1.0186579952817628E-2,4.3527852799268903E-3,51,0,2613,0,523,51]
[3402347280,"1213","Monroe township","Middlesex",3,76,0,4.7795285644897989E-2,0.12185955443723759,2.4511134488685048E-2,6.4721991523606873E-2,751,0,20289,0,1000,751]
[3402351210,"1214","New Brunswick city","Middlesex",3,1225,1,0,0,0,0,0,0,15387,0,1000,0]
[3402352560,"1215","North Brunswick township","Middlesex",3,130,0,3.2899426170214609E-2,8.3083808340136452E-3,2.0702152911223556E-2,2.0636653305150604E-2,239,0,15025,0,1000,239]
[3402354705,"1209","Old Bridge township","Middlesex",3,318,0,3.0187107591816451E-2,0.12317112584325499,2.386070884590509E-2,5.9072980760325501E-2,685,0,25059,0,1000,685]
[3402358200,"1216","Perth Amboy city","Middlesex",3,987,1,0,0,0,0,0,0,17136,0,1000,0]
[3402359010,"1217","Piscataway township","Middlesex",3,150,0,9.7104248614567235E-2,1.5062065481631397E-2,2.730806169435418E-2,4.6491458596850943E-2,539,0,18071,0,1000,539]
[3402359280,"1218","Plainsboro township","Middlesex",3,53,0,2.5020261817941723E-2,3.6692253565426068E-2,1.8140605285105006E-2,2.6617706889490934E-2,309,0,9720,0,1000,309]
[3402365790,"1219","Sayreville borough","Middlesex",3,194,0,2.206225605468724E-2,3.1858183816501837E-2,1.5767542446573711E-2,2.3229327439254266E-2,270,0,16910,0,1000,270]
[3402368550,"1220","South Amboy city","Middlesex",3,19,0,3.4356230491110781E-3,2.5825758935043544E-3,6.7668094540719653E-3,4.2616694655624662E-3,49,0,3740,0,748,49]
[3402368790,"1221","South Brunswick township","Middlesex",3,132,0,9.6831545104513181E-2,0.11739324745810659,3.3726789540153207E-2,8.2650527367591001E-2,959,0,16014,0,1000,959]
[3402369390,"1222","South Plainfield borough","Middlesex",3,54,0,3.5479609164391579E-2,1.4841830349285961E-3,1.6711630261658433E-2,1.7891807486992869E-2,208,0,8217,0,1000,208]
[3402369420,"1223","South River borough","Middlesex",3,66,0,5.9595465035890728E-3,1.9970831769728641E-3,8.0577740093994172E-3,5.3381345633204515E-3,62,0,5694,0,1000,62]
[3402369810,"1224","Spotswood borough","Middlesex",3,7,0,2.3336652970887351E-3,1.3903388477618764E-3,7.1475991306171483E-3,3.6238677584892534E-3,42,0,3196,0,639,42]
[3402382000,"1225","Woodbridge township","Middlesex",3,694,1,0,0,0,0,0,0,36381,0,1000,0]
[3402500070,"1330","Aberdeen township","Monmouth",4,0,0,6.5792253696180213E-3,2.0673442942347356E-3,1.3359490701977162E-2,7.3353534552766395E-3,101,0,7697,0,1000,101]
[3402500730,"1301","Allenhurst borough","Monmouth",4,4,0,1.5689723442162335E-3,0,3.7766999537076555E-3,1.7818907659746296E-3,25,0,199,0,40,25]
[3402500760,"1302","Allentown borough","Monmouth",4,0,0,3.3732280839768476E-4,2.7480177425935506E-4,5.5738145332827026E-3,2.0619797053132477E-3,28,0,694,0,139,28]
[3402501960,"1303","Asbury Park city","Monmouth",4,214,1,0,0,0,0,0,0,7087,0,1000,0]
[3402502110,"1304","Atlantic Highlands borough","Monmouth",4,0,0,2.8048589763470344E-3,5.0090437171737123E-4,7.2182953196193878E-3,3.5080195558945975E-3,48,0,1949,0,390,48]
[3402502440,"1305","Avon-by-the-Sea borough","Monmouth",4,5,0,1.0974157718324749E-3,0,5.1690940446029966E-3,2.0888366054784904E-3,29,0,902,0,180,29]
[3402504930,"1306","Belmar borough","Monmouth",4,0,0,4.518178772782655E-3,0,4.9023044844317652E-3,3.1401610857381399E-3,43,0,2867,0,573,43]
[3402506970,"1307","Bradley Beach borough","Monmouth",4,64,0,2.03289433856319E-3,0,4.445404287491652E-3,2.1594328753516139E-3,30,0,2157,0,431,30]
[3402507750,"1308","Brielle borough","Monmouth",4,0,0,2.6270111126129631E-3,3.1622891295019688E-4,1.1229508603961011E-2,4.7242495431747238E-3,65,0,1949,0,390,65]
[3402514560,"1309","Colts Neck township","Monmouth",4,0,0,4.8234934704972149E-3,0,1.7122126716433855E-2,7.3152067289770232E-3,101,0,3307,0,661,101]
[3402516660,"1310","Deal borough","Monmouth",4,5,0,9.5189083153566947E-4,8.3318178008913929E-5,2.1676626532845409E-3,1.0676238876097081E-3,15,0,347,0,69,15]
[3402519840,"1311","Eatontown borough","Monmouth",4,20,0,3.135063977424192E-2,3.8982140768040745E-3,6.6031703660744791E-3,1.3950674739040159E-2,193,0,5842,0,1000,193]
[3402521570,"1312","Englishtown borough","Monmouth",4,25,0,1.4319885184461349E-3,3.4524499076922261E-4,4.657507754904925E-3,2.1449137547067607E-3,30,0,789,0,158,30]
[3402522440,"1313","Fair Haven borough","Monmouth",4,0,0,1.4881848183371613E-3,7.480104178340412E-5,1.8516643083842186E-2,6.6932096479875832E-3,92,0,1994,0,399,92]
[3402522950,"1314","Farmingdale borough","Monmouth",4,0,0,9.8692065803805728E-4,1.4412139598569377E-5,3.866870625752525E-3,1.6227344744630505E-3,22,0,616,0,123,22]
[3402525200,"1315","Freehold borough","Monmouth",4,270,0,6.7417279047185166E-3,2.7294816402857557E-4,3.5184400574352244E-3,3.5110387087274389E-3,49,0,4143,0,829,49]
[3402525230,"1316","Freehold township","Monmouth",4,39,0,4.4913382964339284E-2,5.7003180456418334E-2,2.1344371589579605E-2,4.1086978336779073E-2,568,0,12897,0,1000,568]
[3402530690,"1339","Hazlet township","Monmouth",4,0,0,1.099315043151668E-2,6.6883866471985614E-3,1.2780711315187803E-2,1.0154082797967682E-2,140,0,7179,0,1000,140]
[3402531500,"1317","Highlands borough","Monmouth",4,0,0,1.972329797320121E-3,2.6018666156501506E-5,4.4895519386655928E-3,2.1626334673807385E-3,30,0,2425,0,485,30]
[3402532640,"1318","Holmdel township","Monmouth",4,129,0,1.8155981715039884E-3,7.6063619132523035E-3,1.9409603218544673E-2,9.6105211011003212E-3,133,0,5787,0,1000,133]
[3402533300,"1319","Howell township","Monmouth",4,63,0,2.7702601250441911E-2,1.8419684072185378E-2,2.7230921330092216E-2,2.445106888423983E-2,338,0,18906,0,1000,338]
[3402534200,"1320","Interlaken borough","Monmouth",4,0,0,0,1.9062584048181703E-5,8.4898182502857016E-3,2.8362936114446277E-3,39,0,362,0,72,39]
[3402536480,"1321","Keansburg borough","Monmouth",4,91,0,2.3291389150233849E-3,6.6529469269796754E-6,4.428656092136528E-3,2.2548159846956309E-3,31,0,3808,0,762,31]
[3402536810,"1322","Keyport borough","Monmouth",4,29,0,4.2851281808650929E-3,1.6362861477096683E-4,3.6712760489850515E-3,2.7066776148737038E-3,37,0,3202,0,640,37]
[3402537560,"1347","Lake Como borough","Monmouth",4,11,0,1.0218848376577494E-3,0,3.1512682036777206E-3,1.3910510137784902E-3,19,0,778,0,156,19]
[3402540770,"1323","Little Silver borough","Monmouth",4,0,0,3.0231329393777136E-3,5.9669743165441337E-4,1.7584282579967726E-2,7.0680376503332839E-3,98,0,2196,0,439,98]
[3402541010,"1324","Loch Arbour village","Monmouth",4,0,0,1.1541126629354801E-4,0,5.6591689324369783E-3,1.9248600662435088E-3,27,0,94,1,19,19]
[3402541310,"1325","Long Branch city","Monmouth",4,317,1,0,0,0,0,0,0,12391,0,1000,0]
[3402542990,"1326","Manalapan township","Monmouth",4,62,0,1.5096474681195016E-2,1.7880323408920405E-2,2.8155673086393593E-2,2.037749039216967E-2,282,0,14325,0,1000,282]
[3402543050,"1327","Manasquan borough","Monmouth",4,0,0,5.474525519559066E-3,2.4190244616023777E-5,9.0452341244966396E-3,4.8479832962239101E-3,67,0,2462,0,492,67]
[3402544070,"1328","Marlboro township","Monmouth",4,5,0,2.249332281791221E-2,7.0163535943120234E-2,3.299809506881015E-2,4.188498460994753E-2,579,0,13774,0,1000,579]
[3402544520,"1329","Matawan borough","Monmouth",4,0,0,4.0506011012705996E-3,1.2961055692630029E-3,9.8968706833924142E-3,5.0811924513086719E-3,70,0,3849,0,770,70]
[3402545990,"1331","Middletown township","Monmouth",4,186,0,1.5783912218108924E-2,2.0962380309411634E-2,3.8368977428223629E-2,2.5038423318581398E-2,346,0,24710,0,1000,346]
[3402546560,"1332","Millstone township","Monmouth",4,7,0,3.6622247312822587E-3,0,1.7532382055422086E-2,7.0648689289014481E-3,98,0,3324,0,665,98]
[3402547130,"1333","Monmouth Beach borough","Monmouth",4,0,0,8.7469345797596429E-4,2.8930669768266719E-5,9.2364827847818184E-3,3.380035637508683E-3,47,0,1452,0,290,47]
[3402549890,"1334","Neptune township","Monmouth",4,97,0,1.8331284523033922E-2,8.396459954347785E-3,1.0230975166838574E-2,1.2319573214740094E-2,170,0,11466,0,1000,170]
[3402549920,"1335","Neptune City borough","Monmouth",4,12,0,3.0777657159228749E-3,7.5946283956054533E-5,3.8217323068326309E-3,2.3251481022371866E-3,32,0,2109,0,422,32]
[3402554270,"1337","Ocean township","Monmouth",4,51,0,1.6009373509267392E-2,5.355543545649555E-3,1.4695888832614662E-2,1.2020268629177202E-2,166,0,11249,0,1000,166]
[3402554570,"1338","Oceanport borough","Monmouth",4,0,0,3.5082649200532711E-3,5.4738172473282551E-4,9.2561852137303668E-3,4.4372772861721544E-3,61,0,2346,0,469,61]
[3402562430,"1340","Red Bank borough","Monmouth",4,54,0,2.642738332665549E-2,8.2612720866332651E-5,6.9571774889244219E-3,1.1155724512148748E-2,154,0,5423,0,1000,154]
[3402564410,"1341","Roosevelt borough","Monmouth",4,30,0,2.2398408623926269E-5,0,4.3216339626604774E-3,1.4480107904281346E-3,20,0,307,0,61,20]
[3402565130,"1342","Rumson borough","Monmouth",4,0,0,4.1238513805190308E-3,1.5318947308687043E-4,2.1102293508403834E-2,8.459778120669911E-3,117,0,2398,0,480,117]
[3402566240,"1343","Sea Bright borough","Monmouth",4,0,0,4.5842231490998047E-3,0,5.4288626211537148E-3,3.3376952567511727E-3,46,0,793,0,159,46]
[3402566330,"1344","Sea Girt borough","Monmouth",4,0,0,1.1323926811791533E-3,3.5936495985428659E-4,1.4345087589779067E-2,5.2789484102708359E-3,73,0,786,0,157,73]
[3402567350,"1345","Shrewsbury borough","Monmouth",4,35,0,1.052460685527448E-2,1.7243267954313054E-4,1.0252668281811107E-2,6.9832359388762389E-3,97,0,1456,0,291,97]
[3402567365,"1346","Shrewsbury township","Monmouth",4,4,0,0,0,2.6092979112782547E-3,8.6976597042608486E-4,12,0,505,0,101,12]
[3402570110,"1348","Spring Lake borough","Monmouth",4,10,0,4.6629832371350667E-3,1.0789275551711968E-4,9.9947900709852558E-3,4.9218886878791479E-3,68,0,1225,0,245,68]
[3402570140,"1349","Spring Lake Heights borough","Monmouth",4,35,0,3.244955845947535E-3,1.4246186094393239E-4,6.2262957082278528E-3,3.2045711383731066E-3,44,0,2428,0,486,44]
[3402573020,"1336","Tinton Falls borough","Monmouth",4,413,0,2.3120569472644209E-2,1.2203345028075624E-2,1.2148371419189763E-2,1.5824095306636532E-2,219,0,8500,0,1000,219]
[3402574540,"1350","Union Beach borough","Monmouth",4,0,0,6.0341541487666855E-4,1.2195935260192457E-3,7.9122888980572969E-3,3.2450992796510705E-3,45,0,2036,0,407,45]
[3402574900,"1351","Upper Freehold township","Monmouth",4,15,0,1.987267825538199E-3,0,1.3242458143714287E-2,5.0765753230841626E-3,70,0,2471,0,494,70]
[3402576460,"1352","Wall township","Monmouth",4,224,0,5.7480918552666356E-2,8.4652528302096866E-2,1.9350376054214798E-2,5.3827940969659344E-2,744,0,10121,0,1000,744]
[3402579310,"1353","West Long Branch borough","Monmouth",4,0,0,5.2871403516811903E-3,5.9242346083641928E-4,7.5722166744982963E-3,4.483926829005302E-3,62,0,2551,0,510,62]
[3402706610,"1401","Boonton town","Morris",2,23,0,7.2213199310329126E-3,9.9567431626656506E-3,5.1869756108848062E-3,7.4550129015277895E-3,153,0,3412,0,682,153]
[3402706640,"1402","Boonton township","Morris",2,4,0,9.4295957051639156E-4,1.4070132997004998E-3,9.5394607296751532E-3,3.9631445332973482E-3,81,0,1504,0,301,81]
[3402709040,"1403","Butler borough","Morris",2,0,0,5.5780808831627105E-3,1.6760541607298781E-3,6.4691983227585532E-3,4.57444445555038E-3,94,0,3258,0,652,94]
[3402712100,"1404","Chatham borough","Morris",2,8,0,5.9404734265066225E-3,7.2977000005583362E-4,1.9869058587150185E-2,8.8464340045708804E-3,181,0,3057,0,611,181]
[3402712130,"1405","Chatham township","Morris",2,30,0,2.7826813898640035E-3,2.293576651446365E-3,1.7711879961598828E-2,7.5960460009697325E-3,156,0,3963,0,793,156]
[3402712580,"1406","Chester borough","Morris",2,10,0,3.7738787727428745E-3,3.0847206564780497E-4,6.519298003591298E-3,3.5338829473273259E-3,72,0,633,0,127,72]
[3402712610,"1407","Chester township","Morris",2,0,0,7.916047269153053E-4,6.16059815573432E-4,1.6152805551207496E-2,5.8534900312320779E-3,120,0,2575,0,515,120]
[3402717650,"1408","Denville township","Morris",2,58,0,1.651192266953078E-2,3.8891603348098727E-2,1.5583460015440923E-2,2.366232867769014E-2,485,0,6442,0,1000,485]
[3402718070,"1409","Dover town","Morris",2,349,0,1.3067842313245101E-2,5.095097824922225E-4,2.9811670067006893E-3,5.5195063674793382E-3,113,0,5752,0,1000,113]
[3402719210,"1410","East Hanover township","Morris",2,0,0,2.5630888022001634E-2,9.8622665161158512E-3,1.0642454554274322E-2,1.5378536364130604E-2,315,0,3935,0,787,315]
[3402723910,"1411","Florham Park borough","Morris",2,66,0,2.1641763078856381E-2,1.7472492362485412E-2,1.1201913784360577E-2,1.6772056408567458E-2,344,0,4468,0,894,344]
[3402729550,"1412","Hanover township","Morris",2,69,0,4.845769406230576E-2,1.7662912672257933E-2,1.3420060480761591E-2,2.651355573844176E-2,544,0,5694,0,1000,544]
[3402729700,"1413","Harding township","Morris",2,0,0,1.5617017633265274E-3,2.5549314209826193E-3,8.0241529940177966E-3,4.0469287261089811E-3,83,0,1419,0,284,83]
[3402734980,"1414","Jefferson township","Morris",2,52,0,5.9205709971394795E-3,2.223566370464795E-2,1.1955251708793397E-2,1.3370495470193609E-2,274,0,7840,0,1000,274]
[3402737110,"1415","Kinnelon borough","Morris",2,22,0,2.1293852476230494E-3,4.0556169009557389E-5,1.2778410902383325E-2,4.9827841063386441E-3,102,0,3405,0,681,102]
[3402740290,"1416","Lincoln Park borough","Morris",2,15,0,4.270739305875711E-3,1.7864204745967411E-2,7.3815402851132635E-3,9.8388281123187957E-3,202,0,4063,0,813,202]
[3402741362,"1430","Long Hill township","Morris",2,0,0,4.3194843656343598E-3,9.5299042559919724E-5,1.0572538884484809E-2,4.995774097559697E-3,102,0,3118,0,624,102]
[3402742510,"1417","Madison borough","Morris",2,0,0,1.1146925770295569E-2,3.6706600665696383E-3,1.5262164628314482E-2,1.0026583488393229E-2,206,0,5705,0,1000,206]
[3402745330,"1418","Mendham borough","Morris",2,0,0,1.8222162214787763E-3,3.9629566692206851E-3,1.3664538322591678E-2,6.4832370710970469E-3,133,0,1762,0,352,133]
[3402745360,"1419","Mendham township","Morris",2,0,0,1.8412154181032272E-4,6.0843337111189568E-4,1.6728173709714057E-2,5.8402428742120914E-3,120,0,1986,0,397,120]
[3402746860,"1420","Mine Hill township","Morris",2,13,0,1.803035406448649E-3,2.795473040696962E-3,4.9721954162529614E-3,3.1902346211328571E-3,65,0,1477,0,295,65]
[3402747670,"1421","Montville township","Morris",2,9,0,1.1880135928503179E-2,2.9491896976839384E-2,1.8616764915916333E-2,1.999626594041963E-2,410,0,7901,0,1000,410]
[3402748090,"1422","Morris township","Morris",2,9,0,6.3097796203269527E-3,5.3740778407727723E-2,2.3444297958440809E-2,2.7831618662165158E-2,571,0,8587,0,1000,571]
[3402748210,"1423","Morris Plains borough","Morris",2,0,0,4.291779104470656E-3,6.7979084566645864E-3,8.9522760404611192E-3,6.6806545338654539E-3,137,0,2432,0,486,137]
[3402748300,"1424","Morristown town","Morris",2,140,0,2.931711858740077E-2,8.8509862851426317E-3,1.1729156323385202E-2,1.6632420398642867E-2,341,0,8482,0,1000,341]
[3402748480,"1425","Mountain Lakes borough","Morris",2,0,0,2.8723719750242808E-3,2.0292901379230822E-2,1.5946313992784879E-2,1.3037195782346661E-2,267,0,1376,0,275,267]
[3402748690,"1426","Mount Arlington borough","Morris",2,38,0,2.2805619113925677E-3,2.0229479117394658E-3,4.4594803793940353E-3,2.9209967341753563E-3,60,0,2651,0,530,60]
[3402749080,"1427","Mount Olive township","Morris",2,99,0,1.4944790478089675E-2,3.9833807640140467E-2,1.2316907282125044E-2,2.2365168466785063E-2,459,0,11079,0,1000,459]
[3402750130,"1428","Netcong borough","Morris",2,24,0,1.419114417735543E-3,2.82797532883345E-3,3.0839424636135769E-3,2.44367740339419E-3,50,0,1434,0,287,50]
[3402756460,"1429","Parsippany-Troy Hills township","Morris",2,138,0,4.7479750253257118E-2,1.2049824569845517E-2,2.1465732721690785E-2,2.6998435848264474E-2,553,0,21346,0,1000,553]
[3402758110,"1431","Pequannock township","Morris",2,44,0,1.1430200126037175E-2,2.0040394569845799E-2,9.4992407798769433E-3,1.3656611825253304E-2,280,0,6379,0,1000,280]
[3402761890,"1432","Randolph township","Morris",2,84,0,1.686678636576161E-2,1.3013215787892923E-2,2.2070359625351969E-2,1.7316787259668832E-2,355,0,9354,0,1000,355]
[3402763300,"1433","Riverdale borough","Morris",2,44,0,7.7530555861712218E-3,3.5200320412977506E-3,4.7935568772267626E-3,5.3555481682319118E-3,110,0,1929,0,386,110]
[3402764050,"1434","Rockaway borough","Morris",2,195,0,4.5482653378767042E-3,1.6698172387287576E-3,4.4382410319728227E-3,3.5521078695260945E-3,73,0,2561,0,512,73]
[3402764080,"1435","Rockaway township","Morris",2,20,0,2.516890718514073E-2,2.2407535295882536E-2,1.6026359702910088E-2,2.1200934061311117E-2,435,0,9643,0,1000,435]
[3402764980,"1436","Roxbury township","Morris",2,59,0,2.337573047312505E-2,0.10872637004669758,1.2627181382648008E-2,4.8243093967490214E-2,989,0,8356,0,1000,989]
[3402775890,"1437","Victory Gardens borough","Morris",2,8,0,3.4987709940905359E-4,0,5.9335050211158514E-4,3.1440920050687958E-4,6,0,571,0,114,6]
[3402777240,"1438","Washington township","Morris",2,20,0,3.7099296868003135E-3,7.9723792435382364E-3,1.8287584016328524E-2,9.9899643155556914E-3,205,0,6343,0,1000,205]
[3402780390,"1439","Wharton borough","Morris",2,91,0,5.7775805521316486E-3,7.8861761695805835E-4,4.3119034012344326E-3,3.6260338567747131E-3,74,0,2604,0,521,74]
[3402903130,"1501","Barnegat Light borough","Ocean",4,0,0,1.6398934701289758E-3,2.5967074641788788E-2,3.6714868089556991E-3,1.0426151640291155E-2,144,0,321,1,64,64]
[3402903050,"1533","Barnegat township","Ocean",4,38,0,7.4718832065591677E-3,0,7.8779770555014745E-3,5.1166200873535477E-3,71,0,9758,0,1000,71]
[3402903520,"1502","Bay Head borough","Ocean",4,0,0,2.0883982957882142E-3,1.5681975597052854E-4,6.4693929492953117E-3,2.9048703336846849E-3,40,0,434,0,87,40]
[3402903940,"1503","Beach Haven borough","Ocean",4,1,0,5.191438895224742E-3,0,5.1812803327409302E-3,3.4575730759885577E-3,48,0,485,0,97,48]
[3402904180,"1504","Beachwood borough","Ocean",4,8,0,1.5911763307685115E-3,1.7119552425010531E-3,6.8346019936051713E-3,3.3792445222915785E-3,47,0,3719,0,744,47]
[3402905305,"1505","Berkeley township","Ocean",4,150,0,1.2455791910975898E-2,2.6090478632376846E-2,6.8324100991271203E-3,1.5126226880826621E-2,209,0,21040,0,1000,209]
[3402907420,"1506","Brick township","Ocean",4,149,0,3.9680665664021751E-2,1.5791924944517876E-2,2.2607890831658373E-2,2.6026827146732667E-2,360,0,30119,0,1000,360]
[3402918670,"1508","Eagleswood township","Ocean",4,0,0,9.7336577411409576E-4,5.7523771313881561E-4,3.9002779558085158E-3,1.8162938143538091E-3,25,0,676,0,135,25]
[3402930390,"1509","Harvey Cedars borough","Ocean",4,0,0,6.0432722922135738E-4,0,6.0358690931097058E-3,2.2133987741103545E-3,31,0,198,0,40,31]
[3402934530,"1510","Island Heights borough","Ocean",4,5,0,8.3733585027362422E-4,3.6126922357000084E-4,4.9300635749210129E-3,2.0428895495882126E-3,28,0,722,0,144,28]
[3402934680,"1511","Jackson township","Ocean",4,186,0,3.1683066596067753E-2,0.15263348473552091,2.2726313551240985E-2,6.9014288294276555E-2,954,0,20470,0,1000,954]
[3402937380,"1512","Lacey township","Ocean",4,52,0,1.7726589822237543E-2,8.0542302947958291E-3,1.1567051126220133E-2,1.2449290414417835E-2,172,0,11086,0,1000,172]
[3402937770,"1513","Lakehurst borough","Ocean",4,0,0,1.0726320124542271E-3,5.2289272060175823E-4,2.8960147000059878E-3,1.4971798110206575E-3,21,0,908,0,182,21]
[3402938550,"1514","Lakewood township","Ocean",4,878,1,0,0,0,0,0,0,31850,0,1000,0]
[3402939390,"1515","Lavallette borough","Ocean",4,4,0,1.8365981015942411E-3,0,5.4410754739910028E-3,2.4258911918617477E-3,34,0,924,0,185,34]
[3402940560,"1516","Little Egg Harbor township","Ocean",4,32,0,7.5590484082862577E-3,2.4708084813774334E-2,7.6355993677144542E-3,1.3300910863258351E-2,184,0,8715,0,1000,184]
[3402941250,"1517","Long Beach township","Ocean",4,0,0,4.0940634212421473E-3,0,6.1180718745289598E-3,3.4040450985903686E-3,47,0,1593,0,319,47]
[3402943140,"1518","Manchester township","Ocean",4,154,0,1.8871246152183926E-2,6.6964145288495688E-2,3.6245208330883657E-3,2.981997075792266E-2,412,0,24287,0,1000,412]
[3402943380,"1519","Mantoloking borough","Ocean",4,0,0,3.6942622499188071E-4,0,1.4421539229631571E-2,4.9303218182078171E-3,68,0,158,1,32,32]
[3402954300,"1520","Ocean township","Ocean",4,56,0,4.1300745592987732E-3,4.2735011533425833E-3,6.6603049335943812E-3,5.0212935487452459E-3,69,0,3979,0,796,69]
[3402954450,"1521","Ocean Gate borough","Ocean",4,0,0,1.6247969023768823E-4,6.8259304073627969E-5,1.9078200395199374E-3,7.1285301127708457E-4,10,0,851,0,170,10]
[3402958590,"1522","Pine Beach borough","Ocean",4,0,0,3.0759361465135726E-4,2.331004372557896E-4,6.0462432028654004E-3,2.195645751590849E-3,30,0,840,0,168,30]
[3402959790,"1523","Plumsted township","Ocean",4,22,0,2.1127788902299397E-3,0,4.9737760150607435E-3,2.3621849684302277E-3,33,0,2996,0,599,33]
[3402959880,"1524","Point Pleasant borough","Ocean",4,41,0,8.869827372612063E-3,3.2028973373533185E-4,1.0952597702649183E-2,6.714238269665526E-3,93,0,7506,0,1000,93]
[3402959910,"1525","Point Pleasant Beach borough","Ocean",4,10,0,1.1750143226884818E-2,3.0699450083891732E-4,7.3168601119694881E-3,6.4579992798977403E-3,89,0,2045,0,409,89]
[3402966450,"1526","Seaside Heights borough","Ocean",4,20,0,7.1178826714747203E-3,0,6.0022153924696789E-4,2.5727014035738962E-3,36,0,1148,0,230,36]
[3402966480,"1527","Seaside Park borough","Ocean",4,0,0,7.517826008276926E-4,0,3.0574595718846275E-3,1.2697473909041067E-3,18,0,772,0,154,18]
[3402967110,"1528","Ship Bottom borough","Ocean",4,0,0,5.5436462480895682E-3,0,3.9709765959696965E-3,3.1715409480197547E-3,44,0,549,0,110,44]
[3402969510,"1529","South Toms River borough","Ocean",4,0,0,1.4667809171925463E-3,1.6429670090407171E-3,4.5125434836149232E-3,2.5407638032827287E-3,35,0,1081,0,216,35]
[3402970320,"1530","Stafford township","Ocean",4,38,0,2.4860988305628044E-2,7.0571419977223495E-3,1.3248512742736644E-2,1.5055547682029014E-2,208,0,11073,0,1000,208]
[3402971640,"1531","Surf City borough","Ocean",4,2,0,3.0633683636127427E-3,0,5.3425127289373859E-3,2.8019603641833758E-3,39,0,644,0,129,39]
[3402973125,"1507","Toms River township","Ocean",4,526,0,7.25219164598261E-2,4.5900067946846805E-2,2.7096361265381657E-2,4.8506115224018181E-2,670,0,36291,0,1000,670]
[3402974210,"1532","Tuckerton borough","Ocean",4,0,0,1.6488144120227104E-3,1.8614811810379118E-3,3.3761386523619274E-3,2.2954780818075166E-3,32,0,1574,0,315,32]
[3403106340,"1601","Bloomingdale borough","Passaic",1,0,0,1.6244575899968053E-3,3.7653168401690612E-2,7.6809166504050695E-3,1.5652847547364162E-2,434,0,3112,0,622,434]
[3403113690,"1602","Clifton city","Passaic",1,884,1,0,0,0,0,0,0,31968,0,1000,0]
[3403129070,"1603","Haledon borough","Passaic",1,45,0,3.2807727720664918E-3,9.0723105224318114E-3,5.0006907526095774E-3,5.7845913490359611E-3,160,0,3017,0,603,160]
[3403130570,"1604","Hawthorne borough","Passaic",1,105,0,1.0603825117418355E-2,1.2646055473915523E-2,9.2182398591895594E-3,1.0822706816841146E-2,300,0,7624,0,1000,300]
[3403140620,"1605","Little Falls township","Passaic",1,0,0,6.4517214152730535E-3,1.4614237662349658E-2,9.707990335047309E-3,1.0257983137556674E-2,285,0,4721,0,944,285]
[3403153040,"1606","North Haledon borough","Passaic",1,0,0,1.7592507001805867E-3,1.4948042975109497E-2,7.9874592177756228E-3,8.2315842976885684E-3,228,0,3054,0,611,228]
[3403156550,"1607","Passaic city","Passaic",1,3179,1,0,0,0,0,0,0,20595,0,1000,0]
[3403157000,"1608","Paterson city","Passaic",1,3966,1,0,0,0,0,0,0,50326,0,1000,0]
[3403160090,"1609","Pompton Lakes borough","Passaic",1,45,0,3.730366398391239E-3,1.150981346657564E-4,7.6062363707536723E-3,3.8172336346035556E-3,106,0,4200,0,840,106]
[3403161170,"1610","Prospect Park borough","Passaic",1,77,0,9.9354292115506264E-4,6.724115518408607E-3,2.0090837330551583E-4,2.639522270956395E-3,73,0,1932,0,386,73]
[3403163150,"1611","Ringwood borough","Passaic",1,26,0,3.2343780976238088E-3,0,1.109435592573171E-2,4.7762446744518397E-3,133,0,4180,0,836,133]
[3403173140,"1612","Totowa borough","Passaic",1,211,0,3.5835115152878801E-2,1.4250380768443736E-2,6.9977654840084275E-3,1.902775380177699E-2,528,0,3899,0,780,528]
[3403176730,"1613","Wanaque borough","Passaic",1,15,0,2.217007004678551E-3,1.0606401747255008E-2,7.0170043828131331E-3,6.6134710449155636E-3,183,0,4392,0,878,183]
[3403177840,"1614","Wayne township","Passaic",1,162,0,6.1850962576617437E-2,9.4061437042084362E-2,3.2821423403037939E-2,6.2911274340579915E-2,1746,1,19165,1,1000,1000]
[3403179460,"1615","West Milford township","Passaic",1,105,0,7.2212633652827922E-3,0,1.4052666943734896E-2,7.0913101030058963E-3,197,0,9638,0,1000,197]
[3403182423,"1616","Woodland Park borough","Passaic",1,153,0,8.3250019666811607E-3,2.3721075088542352E-2,5.3306179189603481E-3,1.2458898324727954E-2,346,0,5252,0,1000,346]
[3403300880,"1701","Alloway township","Salem",6,20,0,9.3998248617529936E-4,0,1.7224760677388831E-2,6.0549143878547108E-3,11,0,1225,0,245,11]
[3403310610,"1713","Carneys Point township","Salem",6,43,0,2.7675464641338823E-2,0.10653949711143722,1.4101158970511249E-2,4.9438706907762427E-2,93,0,3387,0,677,93]
[3403321240,"1702","Elmer borough","Salem",6,7,0,2.1687966204268962E-3,0,1.0056170906898433E-2,4.07498917577511E-3,8,0,508,0,102,8]
[3403321330,"1703","Elsinboro township","Salem",6,0,0,1.5900958765769106E-4,0,9.1573165606636357E-3,3.1054420494404425E-3,6,0,461,0,92,6]
[3403341640,"1704","Lower Alloways Creek township","Salem",6,0,0,1.0669273208618926E-2,0,7.8110387863820352E-3,6.1601039983336546E-3,12,0,695,0,139,12]
[3403343200,"1705","Mannington township","Salem",6,0,0,1.1797006583951024E-3,0,1.1647329298625051E-2,4.2756766523400517E-3,8,0,509,0,102,8]
[3403354810,"1706","Oldmans township","Salem",6,0,0,1.0502987337655137E-2,0.10965900413382712,1.3347512333415358E-2,4.4503167934965872E-2,84,0,706,0,141,84]
[3403357750,"1707","Penns Grove borough","Salem",6,7,0,2.329002184307588E-3,2.1101415119339996E-4,2.2644929173632623E-5,8.542204215582069E-4,2,0,1684,0,337,2]
[3403357870,"1708","Pennsville township","Salem",6,69,0,6.0210682144284098E-4,5.4258164820350313E-2,1.8731616242454917E-2,2.4530629294749359E-2,46,0,5261,0,1000,46]
[3403358530,"1709","Pilesgrove township","Salem",6,0,0,5.8427427821663436E-3,4.504070653737177E-5,2.5232683591321966E-2,1.0373489026675226E-2,20,0,1570,0,314,20]
[3403359130,"1710","Pittsgrove township","Salem",6,25,0,4.6149474173694761E-3,0,1.4665327163691226E-2,6.426758193686901E-3,12,0,3219,0,644,12]
[3403361470,"1711","Quinton township","Salem",6,4,0,2.4421327182849516E-3,0,9.954955459942065E-3,4.1323627260756723E-3,8,0,1044,0,209,8]
[3403365490,"1712","Salem city","Salem",6,10,0,3.5983159206239663E-3,0,1.3931528166867444E-3,1.6638229124369035E-3,3,0,2093,0,419,3]
[3403375110,"1714","Upper Pittsgrove township","Salem",6,0,0,2.7323755135622066E-3,0,1.0198456511114135E-2,4.3102773415587808E-3,8,0,1330,0,266,8]
[3403382720,"1715","Woodstown borough","Salem",6,9,0,3.5007774298893954E-3,0,1.2616863679131868E-2,5.3725470363404212E-3,10,0,1533,0,307,10]
[3403504450,"1801","Bedminster township","Somerset",3,6,0,5.0463581287317396E-3,1.249917350724542E-3,1.238197301503239E-2,6.2260828314962234E-3,72,0,4222,0,844,72]
[3403505560,"1802","Bernards township","Somerset",3,24,0,7.8401518240474172E-3,1.5142880389520165E-2,3.3275219223095835E-2,1.8752750478887806E-2,218,0,10197,0,1000,218]
[3403505590,"1803","Bernardsville borough","Somerset",3,0,0,3.6305240234862602E-3,9.2778416293372789E-4,2.4770072371081281E-2,9.7761268525004223E-3,113,0,2756,0,551,113]
[3403506790,"1804","Bound Brook borough","Somerset",3,91,0,3.7699126365982301E-3,1.4701512472136459E-5,4.1803998958252582E-3,2.6550046816318749E-3,31,0,4181,0,836,31]
[3403507180,"1805","Branchburg township","Somerset",3,0,0,3.8848736908212916E-2,1.6172158024552706E-2,2.1783280369409831E-2,2.5601391767391818E-2,297,0,5660,0,1000,297]
[3403507720,"1806","Bridgewater township","Somerset",3,130,0,5.6355728383087778E-2,2.5899989809316414E-2,4.0225375284017949E-2,4.0827031158807377E-2,474,0,16044,0,1000,474]
[3403522890,"1807","Far Hills borough","Somerset",3,0,0,3.596459234066521E-4,3.7039492263742487E-4,9.8666438676699008E-3,3.5322282379046592E-3,41,0,372,0,74,41]
[3403524900,"1808","Franklin township","Somerset",3,268,0,0.10762112912636865,4.5798305227621502E-2,3.1113260567849785E-2,6.1510898307279981E-2,714,0,25860,0,1000,714]
[3403527510,"1809","Green Brook township","Somerset",3,26,0,5.5957516554022676E-3,4.2780807364061991E-3,2.1036566067523646E-2,1.0303466153110704E-2,120,0,2436,0,487,120]
[3403531890,"1810","Hillsborough township","Somerset",3,111,0,1.9737611433552234E-2,8.9715501097965486E-2,3.6763017575668848E-2,4.8738710035728855E-2,565,0,15296,0,1000,565]
[3403543620,"1811","Manville borough","Somerset",3,36,0,3.1879589371887041E-3,2.7654309144831086E-4,5.407375939770559E-3,2.9572926561358577E-3,34,0,4092,0,818,34]
[3403546590,"1812","Millstone borough","Somerset",3,0,0,4.8490604388413033E-5,7.1992716929514966E-5,8.3015262414913044E-3,2.8073365209364109E-3,33,0,153,1,31,31]
[3403547580,"1813","Montgomery township","Somerset",3,73,0,6.1620214248139585E-3,1.9545190326573206E-2,4.1598602782504754E-2,2.2435271511297306E-2,260,0,8003,0,1000,260]
[3403553280,"1814","North Plainfield borough","Somerset",3,427,0,9.000903015412778E-3,1.2221943960216352E-3,6.1972256906863126E-3,5.4734410340402419E-3,64,0,7715,0,1000,64]
[3403557300,"1815","Peapack and Gladstone borough","Somerset",3,10,0,-4.6079950348189091E-4,4.4656458995122059E-3,1.5259018501924234E-2,6.4212882993181829E-3,75,0,887,0,177,75]
[3403561980,"1816","Raritan borough","Somerset",3,9,0,1.6091645713343938E-2,2.4358268545857389E-3,7.0702154998564075E-3,8.5325626892620281E-3,99,0,2993,0,599,99]
[3403564320,"1817","Rocky Hill borough","Somerset",3,4,0,4.9733435915957371E-4,1.4081135698893812E-3,7.6204580208081114E-3,3.1753019832856887E-3,37,0,278,0,56,37]
[3403568460,"1818","Somerville borough","Somerset",3,103,0,9.0912396319403326E-3,1.0351042088108044E-3,9.0148869116044115E-3,6.380410250785183E-3,74,0,5050,0,1000,74]
[3403568730,"1819","South Bound Brook borough","Somerset",3,67,0,7.5253640272490761E-4,1.9088625903671747E-5,5.0403280882362501E-3,1.9373177056216098E-3,22,0,1854,0,371,22]
[3403576940,"1820","Warren township","Somerset",3,10,0,6.8544514632713849E-3,3.3804404501348292E-2,2.7176472921302933E-2,2.2611776295307539E-2,262,0,5374,0,1000,262]
[3403577600,"1821","Watchung borough","Somerset",3,35,0,7.722601335769891E-3,8.6890230058187402E-3,1.4421609161642193E-2,1.0277744501076942E-2,119,0,2175,0,435,119]
[3403701330,"1901","Andover borough","Sussex",1,0,0,4.2750533924727535E-4,0,1.7129793877288225E-3,7.1349490899203264E-4,20,0,254,0,51,20]
[3403701360,"1902","Andover township","Sussex",1,11,0,1.9547110268205753E-3,0,5.4986043868000406E-3,2.484438471206872E-3,69,0,2102,0,420,69]
[3403707300,"1903","Branchville borough","Sussex",1,4,0,-1.6064106471927011E-4,0,4.2514816715275364E-3,1.3636135356027554E-3,38,0,334,0,67,38]
[3403709160,"1904","Byram township","Sussex",1,27,0,2.0641298499950726E-3,2.099450026430028E-3,8.312699109635488E-3,4.1587596620201962E-3,115,0,2946,0,589,115]
[3403724810,"1905","Frankford township","Sussex",1,13,0,1.588588949856979E-3,0,5.3049364754430926E-3,2.2978418084333573E-3,64,0,2084,0,417,64]
[3403724930,"1906","Franklin borough","Sussex",1,25,0,3.6109343653970057E-3,3.4323895621177158E-2,3.3040937949184159E-3,1.3746307927164194E-2,381,0,2047,0,409,381]
[3403725140,"1907","Fredon township","Sussex",1,0,0,4.7287853554238489E-4,0,7.1278688943287351E-3,2.5335824766237066E-3,70,0,1192,0,238,70]
[3403727420,"1908","Green township","Sussex",1,4,0,1.1937492938967106E-3,1.8809231633539893E-2,8.6095938580442732E-3,9.5375249284936261E-3,265,0,1244,1,249,249]
[3403729220,"1909","Hamburg borough","Sussex",1,0,0,7.6027318509607757E-4,1.0592270965666015E-2,2.1713070331800506E-3,4.5079503946473809E-3,125,0,1452,0,290,125]
[3403729490,"1910","Hampton township","Sussex",1,0,0,4.1986164771065865E-3,0,4.5209480459997712E-3,2.9065215077021191E-3,81,0,1996,0,399,81]
[3403729850,"1911","Hardyston township","Sussex",1,22,0,3.8771987208453731E-3,0.1644377458370595,7.1043592903800336E-3,5.847310128276164E-2,1622,1,3371,1,674,674]
[3403732910,"1912","Hopatcong borough","Sussex",1,3,0,2.862924238420128E-3,2.2109762729793037E-2,8.1279855810777683E-3,1.1033557516430309E-2,306,0,5724,0,1000,306]
[3403737440,"1913","Lafayette township","Sussex",1,7,0,9.8728557388388276E-4,0,4.5975798547723016E-3,1.8616218095520616E-3,52,0,881,0,176,52]
[3403747430,"1914","Montague township","Sussex",1,23,0,1.8108849758120054E-3,0,4.1658722797261755E-3,1.992252418512727E-3,55,0,1560,0,312,55]
[3403751930,"1915","Newton town","Sussex",1,45,0,5.5204285131503121E-3,0,2.2770879656076131E-3,2.5991721595859749E-3,72,0,3400,0,680,72]
[3403754660,"1916","Ogdensburg borough","Sussex",1,4,0,2.926834227596622E-4,0,4.0136825544624215E-3,1.4354553257406946E-3,40,0,873,0,175,40]
[3403765700,"1917","Sandyston township","Sussex",1,4,0,5.2889711845992076E-4,0,3.609377984647191E-3,1.3794250343690372E-3,38,0,806,0,161,38]
[3403769690,"1918","Sparta township","Sussex",1,10,0,1.1346772873549538E-2,1.67766471281415E-2,1.7994730906367429E-2,1.5372716969352824E-2,427,0,7032,0,1000,427]
[3403770380,"1919","Stanhope borough","Sussex",1,0,0,7.7933870273567171E-4,1.2385280827121521E-2,5.8260680057084782E-3,6.3302291785218906E-3,176,0,1432,0,286,176]
[3403770890,"1920","Stillwater township","Sussex",1,11,0,3.6250446537433064E-4,0,5.3982393526785591E-3,1.9202479393509633E-3,53,0,1609,0,322,53]
[3403771670,"1921","Sussex borough","Sussex",1,14,0,4.3630476412795437E-4,0,9.8384369126335502E-4,4.7338281846376974E-4,13,0,901,0,180,13]
[3403775740,"1922","Vernon township","Sussex",1,33,0,2.8339174249029627E-3,1.8685969910351648E-2,1.1396429718840414E-2,1.0972105684698341E-2,304,0,8612,0,1000,304]
[3403776640,"1923","Walpack township","Sussex",1,0,0,1.6437176117783377E-5,0,0,5.4790587059277927E-6,0,0,5,0,1,0]
[3403776790,"1924","Wantage township","Sussex",1,32,0,2.4713522028580784E-3,0,5.9037016470016978E-3,2.7916846166199257E-3,77,0,4058,0,812,77]
[3403905320,"2001","Berkeley Heights township","Union",2,0,0,1.0998328737070981E-2,1.1651349122649072E-2,1.7558708722467349E-2,1.3402795527395801E-2,275,0,4484,0,897,275]
[3403913150,"2002","Clark township","Union",2,71,0,1.3338546893286068E-2,9.3604052856896709E-4,1.0059021391672137E-2,8.1112029378423902E-3,166,0,5919,0,1000,166]
[3403915640,"2003","Cranford township","Union",2,204,0,1.4232944754140541E-2,6.2419999967743018E-3,1.8792389695561806E-2,1.3089111482158883E-2,268,0,8891,0,1000,268]
[3403921000,"2004","Elizabeth city","Union",2,3132,1,0,0,0,0,0,0,46314,0,1000,0]
[3403922860,"2005","Fanwood borough","Union",2,0,0,3.0138148814644822E-3,3.3357741578777031E-4,1.2581010402320614E-2,5.3094675665242884E-3,109,0,2725,0,545,109]
[3403925800,"2006","Garwood borough","Union",2,31,0,6.3569762690803677E-3,7.4518701820245576E-5,5.2226618044175083E-3,3.8847189251060405E-3,80,0,1920,0,384,80]
[3403931980,"2007","Hillside township","Union",2,224,1,0,0,0,0,0,0,7517,0,1000,0]
[3403936690,"2008","Kenilworth borough","Union",2,35,0,2.4676452357075117E-2,8.6785562221798303E-4,4.9033557741286656E-3,1.0149221251140589E-2,208,0,2932,0,586,208]
[3403940350,"2009","Linden city","Union",2,299,0,9.7462532467235061E-2,7.4407228077836779E-3,1.0233836421353259E-2,3.8379030565457335E-2,787,0,15609,0,1000,787]
[3403948510,"2010","Mountainside borough","Union",2,120,0,9.4196624696071974E-3,4.8530103393175407E-3,1.0726711003731919E-2,8.3331279375522191E-3,171,0,2399,0,480,171]
[3403951810,"2011","New Providence borough","Union",2,20,0,1.3318570804931856E-2,2.3216481835765736E-3,1.5027760726844122E-2,1.0222659905117518E-2,210,0,5071,0,1000,210]
[3403959190,"2012","Plainfield city","Union",2,1346,1,0,0,0,0,0,0,16308,0,1000,0]
[3403961530,"2013","Rahway city","Union",2,98,1,0,0,0,0,0,0,11544,0,1000,0]
[3403964620,"2014","Roselle borough","Union",2,360,1,0,0,0,0,0,0,8008,0,1000,0]
[3403964650,"2015","Roselle Park borough","Union",2,78,0,4.152042561824886E-3,4.0839347493943593E-4,6.4167029414961933E-3,3.6590463260868385E-3,75,0,5213,0,1000,75]
[3403966060,"2016","Scotch Plains township","Union",2,53,0,6.064603375857589E-3,6.8102042558498641E-3,2.2877255262568542E-2,1.1917354298091999E-2,244,0,8807,0,1000,244]
[3403970020,"2017","Springfield township","Union",2,53,0,2.0682329482282075E-2,7.165702516363736E-3,1.373298430065626E-2,1.3860338766434022E-2,284,0,6820,0,1000,284]
[3403971430,"2018","Summit city","Union",2,59,0,2.7078523863141024E-2,2.3735817101521351E-3,2.0966691728873714E-2,1.6806265767388959E-2,345,0,7905,0,1000,345]
[3403974480,"2019","Union township","Union",2,317,0,5.8257124723027444E-2,5.5838490245424905E-3,2.1822022178303906E-2,2.8554331975291281E-2,585,0,20672,0,1000,585]
[3403979040,"2020","Westfield town","Union",2,0,0,2.0781081412092398E-2,7.1255735479340849E-3,3.0169216553192772E-2,1.9358623837739754E-2,397,0,10622,0,1000,397]
[3403981650,"2021","Winfield township","Union",2,8,0,1.1791140063036003E-5,5.3204071218253008E-4,1.0389853011962048E-3,5.2760571781392364E-4,11,0,692,0,138,11]
[3404100670,"2101","Allamuchy township","Warren",2,0,0,2.0810181329533294E-4,3.3837568884643426E-2,7.0067858523266604E-3,1.3684152183421809E-2,281,0,2358,0,472,281]
[3404101030,"2102","Alpha borough","Warren",2,4,0,1.8557103662545842E-3,4.2480034352044924E-3,2.3237007027626989E-3,2.8091381680739251E-3,58,0,972,0,194,58]
[3404104990,"2103","Belvidere town","Warren",2,20,0,-2.3459286116863919E-5,1.5447687819260356E-2,3.6968278841112137E-3,6.3736854724182343E-3,131,0,1031,0,206,131]
[3404106160,"2104","Blairstown township","Warren",2,0,0,1.9412592785278794E-3,0,7.4979339360388792E-3,3.1463977381889197E-3,65,0,2106,0,421,65]
[3404124960,"2105","Franklin township","Warren",2,32,0,1.7422270729235277E-3,6.595546039377489E-3,5.5270254748665364E-3,4.6215995290558509E-3,95,0,1124,0,225,95]
[3404125320,"2106","Frelinghuysen township","Warren",2,0,0,6.8941785105839368E-4,2.7839406654891211E-2,4.9788983778874113E-3,1.1169240961279006E-2,229,0,780,1,156,156]
[3404128260,"2107","Greenwich township","Warren",2,0,0,4.6145858354927367E-3,9.4590334963186348E-2,1.0058211736051108E-2,3.6421044178243399E-2,747,0,1798,1,360,360]
[3404128710,"2108","Hackettstown town","Warren",2,87,0,8.1414076113034035E-3,1.963689099855091E-3,5.2254907221139044E-3,5.1101958110907992E-3,105,0,3769,0,754,105]
[3404129820,"2109","Hardwick township","Warren",2,0,0,-1.6430049052539385E-6,0,4.2373028177374239E-3,1.4118866042773898E-3,29,0,578,0,116,29]
[3404130090,"2110","Harmony township","Warren",2,4,0,6.6349715934813994E-3,4.9383737721233722E-4,3.2409405077109994E-3,3.4565831594682455E-3,71,0,993,0,199,71]
[3404133060,"2111","Hope township","Warren",2,0,0,4.4301376774649872E-4,0,4.0459755730643133E-3,1.4963297802702707E-3,31,0,743,0,149,31]
[3404133930,"2112","Independence township","Warren",2,6,0,9.3540422036319918E-4,4.3976592354226041E-3,4.1595210078629223E-3,3.1641948212162417E-3,65,0,2325,0,465,65]
[3404137320,"2113","Knowlton township","Warren",2,4,0,6.040261439487543E-4,0,4.1040880536040878E-3,1.5693713991842809E-3,32,0,1103,0,221,32]
[3404140110,"2114","Liberty township","Warren",2,25,0,1.0830105728264383E-4,0,5.0415360111650855E-3,1.7166123561492431E-3,35,0,1022,0,204,35]
[3404141490,"2115","Lopatcong township","Warren",2,0,0,5.1411167464213833E-3,2.5070347924891164E-3,5.0477822829892143E-3,4.2319779406332384E-3,87,0,3588,0,718,87]
[3404143320,"2116","Mansfield township","Warren",2,7,0,5.2628225338838654E-3,5.1252335610924987E-2,4.5865456331712828E-3,2.0367234592660047E-2,418,0,3139,0,628,418]
[3404155530,"2117","Oxford township","Warren",2,0,0,1.6007117630694817E-4,3.7679913955004471E-3,3.9734136073960981E-3,2.6338253930678311E-3,54,0,967,0,193,54]
[3404158350,"2119","Phillipsburg town","Warren",2,21,0,3.454526404301815E-3,4.958907455376374E-3,2.5562454452906962E-3,3.6565597683229623E-3,75,0,6024,0,1000,75]
[3404159820,"2120","Pohatcong township","Warren",2,0,0,1.977418124137821E-3,3.5077090694640603E-3,4.0374458548477774E-3,3.1741910161498864E-3,65,0,1310,0,262,65]
[3404177270,"2121","Washington borough","Warren",2,0,0,1.3369745837123741E-3,5.045251498243397E-4,2.0992053689673539E-3,1.3135683675013559E-3,27,0,3002,0,600,27]
[3404177300,"2122","Washington township","Warren",2,31,0,2.8262144223304519E-3,1.7689272336268585E-2,6.040504124775881E-3,8.8519969611249721E-3,181,0,2426,0,485,181]
[3404180570,"2123","White township","Warren",2,100,0,-4.8457169214710351E-4,4.6695822606266861E-2,9.1778763531497813E-4,1.5709679516478243E-2,322,0,2169,0,434,322]