{"text_format":"1","workbook":"xlsx","n_sheets":7,"sheets":["Calculation Window","Printout","ReadMe","Metadata","Municipality Codes","Soil Codes","New Soil-Old Soil"],"not_rendered":{"charts":15,"images":5,"macros":1,"external_links":0,"defined_names":69,"comments":1,"pivot_tables":0},"unopened":[],"bounds":{"document_bytes":16777216,"sheet_cells":100000,"rows_first":2000,"rows_last":500,"rows_between":2000,"halvings":0,"cell_chars":16384,"cell_head_chars":4096},"cells_cut":0,"cells_raw":0,"read":"whole","date_system":"1900"}

{"sheet":"Calculation Window","index":0,"n_rows":569,"n_cols":86,"rows_kept":569,"cut":false,"hidden":false,"merged":[[0,1,0,4],[2,1,2,4],[4,1,4,2],[9,2,9,4],[3,1,3,2],[5,1,5,2],[6,1,6,2],[46,1,46,4],[15,1,17,2],[15,3,17,3],[15,4,17,4],[45,1,45,4],[1,53,1,54],[7,16,7,18],[0,26,2,28],[0,16,0,20],[5,16,5,18],[2,16,3,20],[3,26,4,26],[3,27,3,28],[6,16,6,18],[6,44,6,48],[7,46,8,46],[6,58,7,61],[9,16,9,18],[7,1,7,2],[3,44,4,48],[8,1,8,4],[5,69,5,71],[34,17,34,20],[19,3,20,3],[19,4,20,4],[21,16,21,18],[12,1,12,4],[10,2,10,4],[19,1,20,2],[6,71,7,71],[6,69,7,69],[6,70,7,70],[23,1,23,4],[20,58,20,61],[7,47,7,48],[7,44,8,44],[7,45,8,45]]}
[null," A Recharge-Based Nitrate-Dilution Model for New Jersey V7.0 for Excel 2010",null,null,null,null,"EXPLANATION",null,null,null,null,null,null,null,null,null,"Solve for A (acres/system)",null,null,null,null,null,null,null,null,null,"Lot size & impervious cover relation from TR-55"]
[null,null,null,null,null,null,null,null,null,null,null,null,null,null,null,null,null,"solve for A:",null,null,null,null,null,null,null,null,null,null,null,null,null,null,null,null,null,null,null,null,null,null,null,null,null,null,null,null,null,null,null,null,null,null,null,"Basin Factor",null,1]
[null,"Adjusted Trela-Douglas Model Input Parameters",null,null,null,null,"Change only those variables in yellow boxes to the left.",null,null,null,null,null,null,null,null,null,"(4.4186HM)/(CqA(1-0.179A^-0.5708)) = Rmax ",null,null,null,null,null,null,null,null,null,null,null,null,null,null,null,null,null,null,null,null,null,null,null,null,null,null,null,null,null,null,null,null,null,null,null,null,null,null,null,null,null,null,null,null,null,null,null,null,null,null,null,null,null,null,null,null,null,null,null,null,null,"Abbottstown",1,null,null,"Absecon City (Atlantic Co.)",null,"Aberdeen Twp. (Monmouth Co.)",323]
[null,"parameter",null,"value","units",null,"Use drop-down pick lists for soil and municipality.",null,null,null,null,null,null,null,null,null,null,null,null,null,null,null,null,null,null,null,"Lot Size","Impervious Cover",null,null,null,null,null,null,null,null,null,null,null,null,null,null,null,null,"Adjust dilution model to account for impervious surface on lots",null,null,null,null,null,null,null,null,null,null,null,null,null,{"$f":"+C10","v":"Wellsboro"},null,null,null,null,null,null,null,null,null,null,null,null,null,null,null,null,null,null,null,"Adelphia",2,null,null,"Atlantic City (Atlantic Co.)",null,"Absecon City (Atlantic Co.)",1]
[null,"population density:",null,3,"people/home",null,"After entering all parameters, click the 'SOLVE' button and ",null,null,null,null,null,null,null,null,null,null,"where:",null,null,null,null,null,null,null,null,null,"TR-55","curve",null,null,null,null,null,null,null,null,null,null,null,null,null,null,null,null,null,null,null,null,null,null,null,null,null,null,null,null,null,{"$f":"+C11","v":"Lambertville City (Hunterdon Co.)"},null,null,null,null,null,null,null,null,null,null,null,null,null,null,null,null,null,null,null,"Adelphia Variant",3,null,null,"Brigantine City (Atlantic Co.)",null,"Alexandria Twp. (Hunterdon Co.)",259]
[null,"human nitrate loading rate",null,10,"pounds/person/year",null,"     then check \"OK\" in order to calculate the minimum lot size",null,null,null,null,null,null,null,null,null,"H = population density = ",null,null,{"$f":"+H","v":3},"people/home",null,null,null,null,null,{"$f":"1/8","v":0.125},0.65,{"$f":"0.179*AA6^-0.5708","v":0.58659289120676483},null,null,null,null,null,null,null,null,null,null,null,null,null,null,null,null,null,null,null,null,null,null,null,null,null,null,null,null,null,null,null,null,null,null,null,null,null,null,null,null,"Graphing Values",null,null,null,null,null,null,null,null,"Adrian",4,null,null,"Buena Boro. (Atlantic Co.)",null,"Allamuchy Twp. (Warren Co.)",545]
[null,"NO3 target:",null,2," mg/l",null,"     needed to dilute nitrate in the effluent to the specified target.",null,null,null,null,null,null,null,null,null,"M = human nitrate loading rate",null,null,{"$f":"+M","v":10},"pounds/person/year",null,null,null,null,null,0.25,0.38,0.39491976874468593,null,null,null,null,null,null,null,null,null,null,null,null,null,null,null,"Trela-Douglas",null,null,null,null,null,null,null,null,null,null,null,null,null,"GSR-32 Analysis",null,null,null,null,null,null,null,null,null,null,"lot size","from GSR-32","TD w/ adj",null,null,null,null,null,null,"Albia",5,null,null,"Buena Vista Twp. (Atlantic Co.)",null,"Allendale Boro. (Bergen Co.)",24]
[null,null,null,null,null,null,"Click the 'Print Results' button to print a summary sheet of results.",null,null,null,null,null,null,null,null,null,"Cq = NO3 target = ",null,null,{"$f":"+Cq","v":2}," mg/l",null,null,null,null,null,{"$f":"1/3","v":0.33333333333333331},0.3,0.33511498113761168,null,null,null,null,null,null,null,null,null,null,null,null,null,null,null,"Lot Size","% imp. ","modified lot","necessary recharge",null,null,null,null,null,null,3,5.2,10,null,null,null,null,null,null,null,null,null,null,null,null,null,null,null,null,null,null,null,null,null,"Alden",6,null,null,"Corbin City (Atlantic Co.)",null,"Allenhurst Boro. (Monmouth Co.)",324]
[null,"Ground-Water Recharge Methodology Input Parameters",null,null,null,null,"Click the 'Read Me!' button for some more explanation",null,null,null,null,null,null,null,null,null,null,null,null,null,null,null,null,null,null,null,0.5,0.25,0.26587711184925034,null,null,null,null,null,null,null,null,null,null,null,null,null,null,null,null,null,null,"w/o impervious adj","w/ impervious adj",null,null,null,null,"acres","in/yr","in/yr","in/yr",null,{"$f":"VLOOKUP(+C10,CA3:CB331,2)","v":314},{"$f":"VLOOKUP(+C11,CG3:CH569,2)","v":275},null,null,null,null,null,null,null,null,null,0,{"$f":"+S","v":11.5477515},null,null,null,null,null,null,null,"Alloway",7,null,null,"Egg Harbor City (Atlantic Co.)",null,"Allentown Boro. (Monmouth Co.)",325]
[null,"Soil","Wellsboro",null,null,null,"Detailed explanations are in the Metadata worksheet.",null,null,null,null,null,null,null,null,null,"Rmax = max ground water recharge = ",null,null,{"$f":"+S","v":11.5477515},"inches/year",null,null,null,null,null,1,0.2,0.17899999999999999,null,null,null,null,null,null,null,null,null,null,null,null,null,null,null,40,{"$f":"0.179*AS10^-0.5708","v":2.1797023274547023E-2},{"$f":"+AS10*(1-AT10)","v":39.128119069018119},{"$f":"4.4186*H*M/(Cq*AS10)","v":1.6569749999999999},{"$f":"4.4186*H*M/(Cq*AU10)","v":1.6938969103802413},null,null,null,null,20,2.2832219193375773,1.3172434150024486,0.68496657580127329,null,null,"CF =",{"$f":"+VLOOKUP(+BH9,'Municipality Codes'!A5:G571,5+BM14)","v":1.3939299999999999},null,null,null,null,null,null,null,null,{"$f":"MAX(1+A,40)","v":40},{"$f":"+S","v":11.5477515},null,null,null,null,null,null,null,"Alluvial Land",8,null,null,"Egg Harbor Twp. (Atlantic Co.)",null,"Alloway Twp. (Salem Co.)",464]
[null,"Municipality","Lambertville City (Hunterdon Co.)",null,null,null,null,null,null,null,null,null,null,null,null,null,null,null,null,null,null,null,null,null,null,null,2,0.12,0.12051056135349826,null,null,null,null,null,null,null,null,null,null,null,null,null,null,null,35,2.352334029619324E-2,34.176683089633237,1.8936857142857142,1.9393046372046652,null,null,null,null,19,2.4057831172922195,1.3879517984378189,0.72173493518766596,null,null,"RF","RC",null,null,false,{"$f":"IF(BL11,0,0)","v":0},null,null,null,null,{"$f":"+AS10","v":40},null,{"$f":"+AW10","v":1.6938969103802413},null,null,null,null,null,null,"Alluvial Land-Wet",9,null,null,"Estell Manor City (Atlantic Co.)",null,"Alpha Boro. (Warren Co.)",546]
[null,null,null,null,null,null,null,null,null,null,null,null,null,null,null,null,null,null,null,null,null,null,null,null,null,null,null,null,null,null,null,null,null,null,null,null,null,null,null,null,null,null,null,null,30,2.5686930980181471E-2,29.229392070594557,2.2092999999999998,2.2675463054422607,null,null,null,null,18,2.5421856916195038,1.4666455913189445,0.76265570748585121,null,null,{"$f":"VLOOKUP(+BG9,'Soil Codes'!$A$5:$H$333,4)","v":13.55},{"$f":"VLOOKUP(+BG9,'Soil Codes'!$A$5:$W$333,19)","v":7.34},null,null,true,{"$f":"IF(BL12,1,0)","v":1},null,null,null,null,{"$f":"+AS11","v":35},null,{"$f":"+AW11","v":1.9393046372046652},null,null,null,null,null,null,"Amwell",10,null,null,"Folsom Boro. (Atlantic Co.)",null,"Alpine Boro. (Bergen Co.)",25]
[null,"Notes",null,null,null,null,null,null,null,null,null,null,null,null,null,null,null,null,null,null,null,null,null,null,null,null,null,null,null,null,null,null,null,null,null,null,null,null,null,null,null,null,null,null,25,2.8504201144956377E-2,24.287394971376091,2.65116,2.7289464381879207,null,null,null,null,17,2.694908396078219,1.5547548438912802,0.80847251882346582,null,null,{"$f":"VLOOKUP(+BG9,'Soil Codes'!$A$5:$H$333,8)","v":11.25},{"$f":"VLOOKUP(+BG9,'Soil Codes'!$A$5:$W$333,23)","v":6.09},null,null,false,{"$f":"IF(BL13,2,0)","v":0},null,null,null,null,30,null,2.2675463054422607,null,null,null,null,null,null,"Annandale",11,null,null,"Galloway Twp. (Atlantic Co.)",null,"Andover Boro. (Sussex Co.)",500]
[null,null,null,null,null,null,null,null,null,null,null,null,null,null,null,null,null,null,null,null,null,null,null,null,null,null,null,null,null,null,null,null,null,null,null,null,null,null,null,null,null,null,null,null,20,3.2376142989650566E-2,19.35247714020699,3.3139499999999997,3.4248328790063662,null,null,null,null,16,2.8670583174299225,1.6540721062095702,0.86011749522897651,null,null,{"$f":"VLOOKUP(+BG9,'Soil Codes'!$A$5:$H$333,7)","v":10.44},{"$f":"VLOOKUP(+BG9,'Soil Codes'!$A$5:$W$333,22)","v":5.65},null,null,null,{"$f":"SUM(BM11:BM13)","v":1},null,null,null,null,25,null,2.7289464381879207,null,null,null,null,null,null,"Appoquinimink-Broadkill",12,null,null,"Hamilton Twp. (Atlantic Co.)",null,"Andover Twp. (Sussex Co.)",501]
[null,{"$f":"IF(hydric_soil=0,\"Hydric or urban soil. Can't use this method.\",\" \")","v":" "},null,null,null,null,null,null,null,null,null,null,null,null,null,null,null,null,null,null,null,null,null,null,null,null,null,null,null,null,null,null,null,null,null,null,null,null,null,null,null,null,null,null,18,3.4382977659685759E-2,17.381106402125656,3.6821666666666664,3.8132785374292557,null,null,null,null,15,3.0625831482449928,1.7668748932182647,0.91877494447349761,null,null,{"$f":"VLOOKUP(+BG9,'Soil Codes'!$A$5:$H$333,6)","v":9.08},{"$f":"VLOOKUP(+BG9,'Soil Codes'!$A$5:$W$333,21)","v":4.92},null,null,null,null,null,null,null,null,20,null,3.4248328790063662,null,null,null,null,null,null,"Appoquinimink-Transquaking-Mispillion",13,null,null,"Hammonton Town (Atlantic Co.)",null,"Asbury Park City (Monmouth Co.)",326]
[null,{"$f":"IF(BM14=2,+B51,+B50)","v":"Under average conditions, recharge on the pervious portions of this lot is approximately "},null,{"$f":"IF(hydric_soil=1,+S,\"N.A.\")","v":11.5477515},"inches/year",null,"See Division of Watershed Management guidelines for",null,null,null,null,null,null,null,null,null,null,null,null,null,null,null,null,null,null,null,null,null,null,null,null,null,null,null,null,null,null,null,null,null,null,null,null,null,16,3.6774040063626688E-2,15.411615358981972,4.1424374999999998,4.3005874761448828,null,null,null,null,14,3.28657564621308,1.8961013343537003,0.98597269386392405,null,null,{"$f":"VLOOKUP(+BG9,'Soil Codes'!$A$5:$J$256,5)","v":3.44},{"$f":"VLOOKUP(+BG9,'Soil Codes'!$A$5:$Z$333,20)","v":2.57},null,null,null,null,null,null,null,null,18,null,3.8132785374292557,null,null,null,null,null,null,"Aquents",14,null,null,"Linwood City (Atlantic Co.)",null,"Atlantic City (Atlantic Co.)",2]
[null,null,null,null,null,null,"how to apply this model in support of permit applications.",null,null,null,null,null,null,null,null,null,null,null,null,null,null,null,null,null,null,null,null,null,null,null,null,null,null,null,null,null,null,null,null,null,null,null,null,null,14,3.9686531852845937E-2,13.444388554060156,4.7342142857142857,4.9298634693196206,null,null,null,null,13,3.5457205817579602,2.0456080279372846,1.063716174527388,null,null,{"$f":"VLOOKUP(+BG9,'Soil Codes'!$A$5:$J$256,9)","v":1.47},{"$f":"VLOOKUP(+BG9,'Soil Codes'!$A$5:$Z$333,24)","v":1.1000000000000001},null,null,null,null,null,null,null,null,16,null,4.3005874761448828,null,null,null,null,null,null,"Arendtsville",15,null,null,"Longport Boro. (Atlantic Co.)",null,"Atlantic Highlands Boro. (Monmouth Co.)",327]
[null,null,null,null,null,null,null,null,null,null,null,null,null,null,null,null,null,null,null,null,null,null,null,null,null,null,null,null,null,null,null,null,null,null,null,null,null,null,null,null,null,null,null,null,12,4.333675369699936E-2,11.479958955636008,5.52325,5.7734526975343208,null,null,null,null,12,3.8489684650228808,2.2205587298208926,1.1546905395068643,null,null,{"$f":"VLOOKUP(+BG9,'Soil Codes'!$A$5:$J$256,10)","v":0},{"$f":"VLOOKUP(+BG9,'Soil Codes'!$A$5:$Z$333,25)","v":0},null,null,null,null,null,null,null,null,14,null,4.9298634693196206,null,null,null,null,null,null,"Arnot-Lordstown",16,null,null,"Margate City (Atlantic Co.)",null,"Audubon Boro. (Camden Co.)",134]
[null,null,null,null,null,null,null,null,null,null,null,null,null,null,null,null,null,null,null,null,null,null,null,null,null,null,null,null,null,null,null,null,null,null,null,null,null,null,null,null,null,null,null,null,10,4.8089806653109753E-2,9.5191019334689013,6.6278999999999995,6.9627366597435891,null,null,null,null,11,4.2085825296033361,2.428028382463463,1.2625747588810008,null,null,null,null,null,null,null,null,null,null,null,null,12,null,5.7734526975343208,null,null,null,null,null,null,"Arnot-Lordstown rock outcrop",17,null,null,"Mullica Twp. (Atlantic Co.)",null,"Audubon Park Boro. (Camden Co.)",135]
[null,{"$f":"IF(BM14=2,+B47,+B46)","v":"Net average recharge (adjusted for impervious cover)"},null,{"$f":"+D16*(1-ISC)","v":10.81341449852631},"inches/year",null,null,null,null,null,null,null,null,null,null,null,null,null,null,{"$f":"0.179*A^-0.5708","v":6.3591340831476217E-2},null,null,null,null,null,null,null,null,null,null,null,null,null,null,null,null,null,null,null,null,null,null,null,null,9,5.1070652496841021E-2,8.5403641275284308,7.3643333333333327,7.7606761269535056,null,null,null,null,10,4.6418244398290591,2.6779756383629185,1.3925473319487178,null,null,null,null,null,null,null,null,null,null,null,null,10,null,6.9627366597435891,null,null,null,null,null,null,"Atherton",18,null,null,"Northfield City (Atlantic Co.)",null,"Avalon Boro. (Cape May Co.)",171]
{"$rows_left_out":550}
{"sheet":"Printout","index":1,"n_rows":66,"n_cols":6,"rows_kept":66,"cut":false,"hidden":false,"merged":[[25,2,26,3],[31,2,31,3],[22,2,23,3],[28,2,29,4],[1,1,2,5],[9,3,9,4],[10,3,10,5],[18,2,21,3],[6,2,6,3],[8,2,8,5],[14,2,16,3],[3,2,3,5],[4,2,4,3],[5,2,5,3]]}
[]
[null,{"$f":"+'Calculation Window'!B1:E1","v":" A Recharge-Based Nitrate-Dilution Model for New Jersey V7.0 for Excel 2010"}]
[]
[null,null,"Adjusted Trela-Douglas Model Input Parameters"]
[null,null,"population density:",null,{"$f":"+'Calculation Window'!D5","v":3},"people/home"]
[null,null,"nitrate loading rage",null,{"$f":"+'Calculation Window'!D6","v":10},"pounds/person/year"]
[null,null,"NO3 target:",null,{"$f":"+'Calculation Window'!D7","v":2}," mg/l"]
[]
[null,null,"Ground-Water Recharge Methodology Input Parameters"]
[null,null,"Soil",{"$f":"+'Calculation Window'!BG4","v":"Wellsboro"}]
[null,null,"Municipality",{"$f":"+'Calculation Window'!BG5","v":"Lambertville City (Hunterdon Co.)"}]
[]
[null,null,{"$f":"IF(+'Calculation Window'!B43=0,\"Hydric or urban soil. Can't use this method.\",\" \")","v":" "}]
[]
[null,null,"Minimum recharge area needed to dilute nitrate "]
[null,null,null,null,{"$f":"+'Calculation Window'!C26","v":6.1293227297871038},"acres/system"]
[]
[]
[null,null,{"$f":"IF('Calculation Window'!BM14=2,+Printout!B62,Printout!B61)","v":"Average recharge on this soil type in this municipality to a totally pervious lot is approximately "}]
[null,null,null,null,{"$f":"+'Calculation Window'!D16","v":11.5477515},"inches/year"]
{"$rows_left_out":47}
{"sheet":"ReadMe","index":2,"n_rows":21,"n_cols":11,"rows_kept":21,"cut":false,"hidden":false,"merged":[]}
[]
[]
[null,"BRIEF EXPLANATION"]
[]
[]
[]
[]
[null,"      "]
[]
[]
[]
[null,"      ",null,null,null,null,null,null,null,null,"  "]
[]
[null,"    "]
[]
[]
[null,null,null,null,null,null,null,null,null,null,"      "]
[null,null,null,null,null,null,null,null,null,null,"   "]
[]
[]
{"$rows_left_out":2}
{"sheet":"Metadata","index":3,"n_rows":351,"n_cols":2,"rows_kept":351,"cut":false,"hidden":false,"merged":[]}
[]
["METADATA FOR THE FILE"]
["NJ_NO3_DILUTION_V50.XLS"]
[]
[null," "]
[null," "]
["1. IDENTIFICATION INFORMATION"]
[]
["1.1 CITATION"]
[]
["MS Excel Workbook Implementing A Recharge-Based "]
["Nitrate-Dilution Model for New Jersey, version 5.0"]
[]
["   Jeffrey L. Hoffman and Robert J. Canace, 2002"]
[]
[]
["1.2 DESCRIPTION"]
[]
["1.2.1 ABSTRACT"]
[]
{"$rows_left_out":332}
{"sheet":"Municipality Codes","index":4,"n_rows":571,"n_cols":17,"rows_kept":571,"cut":false,"hidden":false,"merged":[[2,0,2,2],[2,4,3,4],[1,4,1,6],[2,5,2,6]]}
[]
[null,null,null,null,"Climate Factors"]
["Municipality Codes Data Window",null,null,null,"original","revised 2008"]
["code","County","Municipality",null,null,"average","drought"]
[1,"Atlantic Co.","Absecon City",null,1.18,1.2574000000000001,1.2175800000000001]
[2,"Atlantic Co.","Atlantic City",null,1.18,1.1907399999999999,1.1500900000000001]
[3,"Atlantic Co.","Brigantine City",null,1.18,1.20303,1.14446]
[4,"Atlantic Co.","Buena Boro.",null,1.35,1.3398000000000001,1.12537]
[5,"Atlantic Co.","Buena Vista Twp.",null,1.35,1.34474,1.1426400000000001,null,null,null,null,null,null,null,null,null,5]
[6,"Atlantic Co.","Corbin City",null,1.33,1.3176600000000001,1.2244999999999999]
[7,"Atlantic Co.","Egg Harbor City",null,1.39,1.37581,1.2723500000000001]
[8,"Atlantic Co.","Egg Harbor Twp.",null,1.2,1.2928999999999999,1.22323]
[9,"Atlantic Co.","Estell Manor City",null,1.33,1.3374600000000001,1.2340599999999999]
[10,"Atlantic Co.","Folsom Boro.",null,1.36,1.3552299999999999,1.12591]
[11,"Atlantic Co.","Galloway Twp.",null,1.27,1.3177099999999999,1.25576]
[12,"Atlantic Co.","Hamilton Twp.",null,1.32,1.3482000000000001,1.19862]
[13,"Atlantic Co.","Hammonton Town",null,1.36,1.38079,1.1854899999999999]
[14,"Atlantic Co.","Linwood City",null,1.18,1.2488300000000001,1.18746]
[15,"Atlantic Co.","Longport Boro.",null,1.18,1.2037199999999999,1.14059]
[16,"Atlantic Co.","Margate City",null,1.18,1.1972799999999999,1.1416299999999999]
{"$rows_left_out":552}
{"sheet":"Soil Codes","index":5,"n_rows":333,"n_cols":34,"rows_kept":333,"cut":false,"hidden":false,"merged":[[2,18,2,31],[2,0,2,1],[2,3,2,16]]}
[]
[]
["Soil Codes Data Window",null,null,"Recharge Factors by Soil Code",null,null,null,null,null,null,null,null,null,null,null,null,null,null,"Recharge Constants by Soil Code"]
["code","Soil",null,0,1,2,3,4,5,6,7,8,9,10,11,12,13,null,0,1,2,3,4,5,6,7,8,9,10,11,12,13,null,"wet/urban?"]
[1,"Abbottstown",null,14.7,5.14,9.85,11.32,12.2,2.2000000000000002,0,6.68,12.15,16.37,10.130000000000001,15.19,17.75,15.68,null,9.3800000000000008,3.28,6.28,7.22,7.79,1.41,0,4.53,7.65,11,6.18,9.85,12.37,10.32,null,{"$f":"IF(SUM(D5:AF5)=0,0,1)","v":1}]
[2,"Adelphia",null,20.73,7.26,13.89,15.96,17.21,3.11,0,10.53,18.260000000000002,23.14,16.399999999999999,21.06,22.56,23.43,null,16.52,5.78,11.07,12.72,13.71,2.48,0,6.8,14.65,19.64,13.19,16.829999999999998,18.239999999999998,20.350000000000001,null,{"$f":"IF(SUM(D6:AF6)=0,0,1)","v":1}]
[3,"Adelphia Variant",null,20.97,7.34,14.05,16.149999999999999,17.399999999999999,3.15,0,9.9700000000000006,18.170000000000002,23.57,16.059999999999999,21.35,23.03,23.84,null,16.96,5.94,11.36,13.06,14.08,2.54,0,6.23,14.64,20.309999999999999,12.86,17.32,18.97,20.97,null,{"$f":"IF(SUM(D7:AF7)=0,0,1)","v":1}]
[4,"Adrian",null,0,0,0,0,0,0,0,0,0,0,0,0,0,0,null,0,0,0,0,0,0,0,0,0,0,0,0,0,0,null,{"$f":"IF(SUM(D8:AF8)=0,0,1)","v":0}]
[5,"Albia",null,15.96,5.59,10.69,12.29,13.25,2.39,0,5.15,12.25,18.399999999999999,9.3000000000000007,16.66,20.48,17.36,null,11.65,4.08,7.81,8.9700000000000006,9.67,1.75,0,0.94,7.54,14.72,4.2300000000000004,12.52,17.399999999999999,13.38,null,{"$f":"IF(SUM(D9:AF9)=0,0,1)","v":1}]
[6,"Alden",null,0,0,0,0,0,0,0,0,0,0,0,0,0,0,null,0,0,0,0,0,0,0,0,0,0,0,0,0,0,null,0]
[7,"Alloway",null,13.81,4.83,9.25,10.63,11.46,2.0699999999999998,0,6.48,12.05,16.649999999999999,10.09,14.98,17.09,16.43,null,7.72,2.7,5.18,5.95,6.41,1.1599999999999999,0,2.39,7.37,11.62,5.93,9.52,11.28,11.78,null,1]
[8,"Alluvial Land",null,0,0,0,0,0,0,0,0,0,0,0,0,0,0,null,0,0,0,0,0,0,0,0,0,0,0,0,0,0,null,{"$f":"IF(SUM(D12:AF12)=0,0,1)","v":0}]
[9,"Alluvial Land-Wet",null,0,0,0,0,0,0,0,0,0,0,0,0,0,0,null,0,0,0,0,0,0,0,0,0,0,0,0,0,0,null,{"$f":"IF(SUM(D13:AF13)=0,0,1)","v":0}]
[10,"Amwell",null,13.3,4.6500000000000004,8.91,10.24,11.04,1.99,0,6.05,11,14.83,9.17,13.75,16.11,14.2,null,6.93,2.4300000000000002,4.6399999999999997,5.34,5.75,1.04,0,3.1,5.53,8.34,4.33,7.34,9.5500000000000007,7.74,null,{"$f":"IF(SUM(D14:AF14)=0,0,1)","v":1}]
[11,"Annandale",null,14.16,4.96,9.49,10.91,11.76,2.12,0,5.0999999999999996,11.53,15.89,9.43,14.67,17.329999999999998,15.17,null,8.86,3.1,5.93,6.82,7.35,1.33,0,0.92,7.05,10.52,5.52,9.33,11.95,9.81,null,{"$f":"IF(SUM(D15:AF15)=0,0,1)","v":1}]
[12,"Appoquinimink-Broadkill",null,0,0,0,0,0,0,0,0,0,0,0,0,0,0,null,0,0,0,0,0,0,0,0,0,0,0,0,0,0,null,0]
[13,"Appoquinimink-Transquaking-Mispillion",null,0,0,0,0,0,0,0,0,0,0,0,0,0,0,null,0,0,0,0,0,0,0,0,0,0,0,0,0,0,null,0]
[14,"Aquents",null,0,0,0,0,0,0,0,0,0,0,0,0,0,0,null,0,0,0,0,0,0,0,0,0,0,0,0,0,0,null,{"$f":"IF(SUM(D18:AF18)=0,0,1)","v":0}]
[15,"Arendtsville",null,19.45,6.81,13.03,14.97,16.14,2.92,0,9.76,17.059999999999999,21.31,14.96,20.2,21.52,21.21,null,14.46,5.0599999999999996,9.69,11.14,12.01,2.17,0,5.27,12.61,16.91,10.63,15.58,16.739999999999998,16.989999999999998,null,{"$f":"IF(SUM(D19:AF19)=0,0,1)","v":1}]
[16,"Arnot-Lordstown",null,13.32,4.66,8.92,10.26,11.05,2,0,5.17,10.63,15.51,8.42,13.94,17.38,14.57,null,6.73,2.36,4.51,5.18,5.59,1.01,0,0.24,4.26,9.42,2.11,7.48,11.77,8.24,null,1]
{"$rows_left_out":314}
{"sheet":"New Soil-Old Soil","index":6,"n_rows":78,"n_cols":3,"rows_kept":78,"cut":false,"hidden":false,"merged":[]}
["SSURGO soil series name","Counties","Assumed equivalent soil from county soil series "]
["Alden","Warren, Sussex, Passaic, Morris","Whitman"]
["Alloway","Salem","Keyport"]
["Appoquinimink-Broadkill","Salem","tidal marsh"]
["Appoquinimink-Transquaking-Mispillion","Ocean, Monmouth, Cumberland, Cape May, Atlantic","sulfaquents and sulfihemists, tidal marshes"]
["Arnot-Lordstown","Warren, Sussex","Nassau-Manlius"]
["Arnot-Lordstown rock outcrop","Sussex, Sussex","Nassau-Manlius rock outcrop"]
["Bigapple","Essex","sand pit"]
["Bigapple-urban land","Essex","urban land"]
["Broadkill","Cumberland","tidal marsh"]
["Buddtown","Burlington","Nixonton"]
["Buddtown-Deptford","Gloucester, Camden, Burlington","Nixonton-Barclay"]
["Buddtown-urban land","Gloucester","urban land"]
["Catden","Warren, Sussex, Passaic, Morris, Essex","Carlisle"]
["Catden-Natchaug","Essex","Carlisle-Palms"]
["Charlton-rock outcrop","Passaic","Rockaway rock outcrop (Warren/Sussex Co.)"]
["Chatfield-Hollis-Rock outcrop","Warren, Sussex, Passaic, Morris","Rockaway rock outcrop (Warren/Sussex Co.)"]
["Chicone","Salem, Gloucester, Cumberland","swamp"]
["Delaware","Warren, Sussex","Riverhead"]
["Dennisville","Cape May","Downer"]
{"$rows_left_out":58}