{"text_format":"1","workbook":"xlsx","n_sheets":9,"sheets":["Instructions","Budget Summary","Subgrantee A","Subgrantee B","Subgrantee C","Subgrantee D","Subgrantee E","Subgrantee F","Data"],"not_rendered":{"charts":0,"images":0,"macros":1,"external_links":0,"defined_names":28,"comments":6,"pivot_tables":6},"unopened":[],"bounds":{"document_bytes":16777216,"sheet_cells":100000,"rows_first":2000,"rows_last":500,"rows_between":2000,"halvings":0,"cell_chars":16384,"cell_head_chars":4096},"cells_cut":0,"cells_raw":0,"read":"whole","date_system":"1900"}

{"sheet":"Instructions","index":0,"n_rows":49,"n_cols":2,"rows_kept":49,"cut":false,"hidden":false,"merged":[[0,0,0,1],[13,0,13,1],[17,0,17,1],[19,0,19,1],[23,0,23,1],[15,0,15,1],[16,0,16,1],[18,0,18,1],[20,0,20,1],[1,0,1,1],[2,0,2,1],[3,0,3,1],[4,0,4,1],[5,0,5,1],[6,0,6,1],[7,0,7,1],[48,0,48,1],[47,0,47,1],[29,0,29,1],[21,0,21,1],[24,0,24,1],[25,0,25,1],[26,0,26,1],[28,0,28,1],[22,0,22,1],[8,0,8,1],[9,0,9,1],[10,0,10,1],[12,0,12,1],[14,0,14,1]]}
["This worksheet contains the instructions for this budget workook and has one table spanning A32 to B36 (row 32 is the header row)."]
["Subgrantee Guidance and Form Instructions"]
["Guidance on preparing and uploading subgrantee/partner budgets as part of an EWEG application may be found in Part II.7. of the Notice of Grant Opportunity."]
["A subgrant is defined as a formal agreement between a grant recipient agency (third party) and another entity (fourth party) to provide an integral part of the grant project and a corresponding portion of the budget. Subgrants do not include procurement purchases or fee-for-service arrangements but may include partnership or consortia agreements where funds are divested for specific grant project activities. "]
["Any subgrantee (fourth party) funded through the project is accountable to the grant recipient agency for the use of funds, subject to applicable federal and state requirements as articulated in the grant agreement issued by the NJDOE, and subject to relevant OMB cash management regulations. "]
["Subgrantees are also accountable to the grant recipient agency for the delivery of project activities and reporting. The details of any proposed subgrants must be described in the grant application narrative. This must include the scope of work, goals, objectives, activities, and a detailed budget. Once the NJDOE approves the application, including the subgrant, and a grant award is issued and accepted, a separate articulation agreement with each subgrantee should be developed."]
["Each articulation agreement must clearly detail all grant activities to be carried out by the subgrantee, the appropriate subgrant terms and conditions that flow down and are applicable to the subgrantee, and the funds that will be allocated to the subgrantee. The NJDOE reserves the right to request a copy of the articulation agreement at any point during the award process or during the grant period. "]
["Generally, unless otherwise permitted by law, regulation, or statute, a subgrant agreement may not be established with a nonpublic school. "]
["Important: It is important to carefully distinguish between subgrantees and consultants or vendors within the budget. Consultants and vendors are organizations, independent entities, or persons hired to provide a specific service or product for a fee within their normal business operations. They operate in a competitive environment and provide services or goods to many different purchasers. They are not employees (either full-time or part-time), and they are not subject to compliance requirements. "]
["In contrast, a subgrantee is an organization that uses grant funds to carry out a portion of the goals and objectives of the project, as opposed to providing goods or services. Their performance is measured against the achievement of the project objectives. Additionally, subgrantees have responsibility for applicable programmatic decision-making and must adhere to applicable program regulations and compliance requirements. "]
["Refer to 2 CFR Part 200.330 for information regarding the distinction between subgrantees/sub-recipients and vendors. "]
[]
["Lead Agency Designation"]
["Agencies that apply in collaboration must select one agency as the lead agency. The agency selected as the lead agency applies for a grant on behalf of a collaborative. In this capacity, the lead agency will serve as the applicant agency of record, as the legally recognized fiscal agent for the grant project, and as the single point of contact for the NJDOE. "]
["The lead agency will be responsible for submitting the grant application in EWEG; overseeing the implementation of all aspects of the grant, i.e., project and spending plan; grant project monitoring and reporting; and fiscal management. The lead agency may not divest oversight responsibilities through a subgrant or to another member of the collaborative. The lead agency will also be required to retain lead agency status throughout the duration of a multi-year program. The collaborative will not be permitted to change lead-agency designation during subsequent grant periods. "]
{"$rows_left_out":35}
{"sheet":"Budget Summary","index":1,"n_rows":35,"n_cols":8,"rows_kept":35,"cut":false,"hidden":false,"merged":[[6,0,6,1],[33,0,33,7],[34,0,34,7],[5,0,5,7],[0,0,0,7],[1,0,1,7],[2,0,2,1],[3,0,3,1],[4,0,4,1],[2,2,2,4],[2,6,2,7],[3,2,3,7],[4,2,4,3],[4,5,4,7]]}
["This worksheet one table spanning columns A through H. Row 8 is the header row. Users enter information in table data cells and cells C3, G3, C4, C5 and F5. The subgrantee names autofill in row 7, columns C through H. In the table, the following cells contain formulas: all cells in columns C through H, the subtotal cells (B15, B20, B27, and B31 to B33)."]
["New Jersey Department of Education \nSubgrantee Budget Form"]
["Lead Agency District Name:",null,null,null,null,"District Code:"]
["NGO Program Name:"]
["NGO#:",null,null,null,"Allocation:"]
[]
[null,null,{"$f":"'Subgrantee A'!B2","v":0},{"$f":"'Subgrantee B'!$B$2","v":0},{"$f":"'Subgrantee C'!$B$2","v":0},{"$f":"'Subgrantee D'!$B$2","v":0},{"$f":"'Subgrantee E'!$B$2","v":0},{"$f":"'Subgrantee F'!$B$2","v":0}]
["Budget Categories","Lead Agency Budget","Subgrantee A","Subgrantee B","Subgrantee C","Subgrantee D","Subgrantee E","Subgrantee F"]
["I. Instruction - Func/Obj Codes\n(rows 10 to 15)","n/a","n/a","n/a","n/a","n/a","n/a","n/a"]
["100-100 Instructional Salary",null,{"$f":"IF(ISNA(VLOOKUP(A10,'Subgrantee A'!B$105:D$126,3,FALSE))=TRUE,\"$0\",VLOOKUP(A10,'Subgrantee A'!B$105:D$126,3,FALSE))","v":"$0"},{"$f":"IF(ISNA(VLOOKUP(A10,'Subgrantee B'!B$104:D$130,3,FALSE))=TRUE,\"$0\",VLOOKUP(A10,'Subgrantee B'!B$104:D$130,3,FALSE))","v":"$0"},{"$f":"IF(ISNA(VLOOKUP(A10,'Subgrantee C'!B$105:E$129,3,FALSE))=TRUE,\"$0\",VLOOKUP(A10,'Subgrantee C'!B$105:E$129,3,FALSE))","v":"$0"},{"$f":"IF(ISNA(VLOOKUP($A$10,'Subgrantee D'!$B$105:$N$130,3,FALSE))=TRUE,\"$0\",VLOOKUP($A$10,'Subgrantee D'!$B$105:$N$130,3,FALSE))","v":"$0"},{"$f":"IF(ISNA(VLOOKUP($A10,'Subgrantee E'!$B$105:$N$130,3,FALSE))=TRUE,\"$0\",VLOOKUP($A10,'Subgrantee E'!$B$105:$N$130,3,FALSE))","v":"$0"},{"$f":"IF(ISNA(VLOOKUP($A10,'Subgrantee F'!$B$105:$N$115,3,FALSE))=TRUE,\"$0\",VLOOKUP($A10,'Subgrantee F'!$B$105:$N$115,3,FALSE))","v":"$0"}]
["100-300 Instructional Purchased Prof &Tech Services",null,{"$f":"IF(ISNA(VLOOKUP(A11,'Subgrantee A'!B$105:D$126,3,FALSE))=TRUE,\"$0\",VLOOKUP(A11,'Subgrantee A'!B$105:D$126,3,FALSE))","v":"$0"},{"$f":"IF(ISNA(VLOOKUP(A11,'Subgrantee B'!B$104:D$130,3,FALSE))=TRUE,\"$0\",VLOOKUP(A11,'Subgrantee B'!B$104:D$130,3,FALSE))","v":"$0"},{"$f":"IF(ISNA(VLOOKUP(A11,'Subgrantee C'!B$105:E$129,3,FALSE))=TRUE,\"$0\",VLOOKUP(A11,'Subgrantee C'!B$105:E$129,3,FALSE))","v":"$0"},{"$f":"IF(ISNA(VLOOKUP(A11,'Subgrantee D'!B$105:N$130,3,FALSE))=TRUE,\"$0\",VLOOKUP(A11,'Subgrantee D'!B$105:N$130,3,FALSE))","v":"$0"},{"$f":"IF(ISNA(VLOOKUP($A11,'Subgrantee E'!$B$105:$N$130,3,FALSE))=TRUE,\"$0\",VLOOKUP($A11,'Subgrantee E'!$B$105:$N$130,3,FALSE))","v":"$0"},{"$f":"IF(ISNA(VLOOKUP($A11,'Subgrantee F'!$B$105:$N$115,3,FALSE))=TRUE,\"$0\",VLOOKUP($A11,'Subgrantee F'!$B$105:$N$115,3,FALSE))","v":"$0"}]
["100-500 Instructional Purchased Services",null,{"$f":"IF(ISNA(VLOOKUP(A12,'Subgrantee A'!B$105:D$126,3,FALSE))=TRUE,\"$0\",VLOOKUP(A12,'Subgrantee A'!B$105:D$126,3,FALSE))","v":"$0"},{"$f":"IF(ISNA(VLOOKUP(A12,'Subgrantee B'!B$104:D$130,3,FALSE))=TRUE,\"$0\",VLOOKUP(A12,'Subgrantee B'!B$104:D$130,3,FALSE))","v":"$0"},{"$f":"IF(ISNA(VLOOKUP(A12,'Subgrantee C'!B$105:E$129,3,FALSE))=TRUE,\"$0\",VLOOKUP(A12,'Subgrantee C'!B$105:E$129,3,FALSE))","v":"$0"},{"$f":"IF(ISNA(VLOOKUP(A12,'Subgrantee D'!B$105:N$130,3,FALSE))=TRUE,\"$0\",VLOOKUP(A12,'Subgrantee D'!B$105:N$130,3,FALSE))","v":"$0"},{"$f":"IF(ISNA(VLOOKUP($A12,'Subgrantee E'!$B$105:$N$130,3,FALSE))=TRUE,\"$0\",VLOOKUP($A12,'Subgrantee E'!$B$105:$N$130,3,FALSE))","v":"$0"},{"$f":"IF(ISNA(VLOOKUP($A12,'Subgrantee F'!$B$105:$N$115,3,FALSE))=TRUE,\"$0\",VLOOKUP($A12,'Subgrantee F'!$B$105:$N$115,3,FALSE))","v":"$0"}]
["100-600 Instructional Supplies",null,{"$f":"IF(ISNA(VLOOKUP(A13,'Subgrantee A'!B$105:D$126,3,FALSE))=TRUE,\"$0\",VLOOKUP(A13,'Subgrantee A'!B$105:D$126,3,FALSE))","v":"$0"},{"$f":"IF(ISNA(VLOOKUP(A13,'Subgrantee B'!B$104:D$130,3,FALSE))=TRUE,\"$0\",VLOOKUP(A13,'Subgrantee B'!B$104:D$130,3,FALSE))","v":"$0"},{"$f":"IF(ISNA(VLOOKUP(A13,'Subgrantee C'!B$105:E$129,3,FALSE))=TRUE,\"$0\",VLOOKUP(A13,'Subgrantee C'!B$105:E$129,3,FALSE))","v":"$0"},{"$f":"IF(ISNA(VLOOKUP(A13,'Subgrantee D'!B$105:N$130,3,FALSE))=TRUE,\"$0\",VLOOKUP(A13,'Subgrantee D'!B$105:N$130,3,FALSE))","v":"$0"},{"$f":"IF(ISNA(VLOOKUP($A13,'Subgrantee E'!$B$105:$N$130,3,FALSE))=TRUE,\"$0\",VLOOKUP($A13,'Subgrantee E'!$B$105:$N$130,3,FALSE))","v":"$0"},{"$f":"IF(ISNA(VLOOKUP($A13,'Subgrantee F'!$B$105:$N$115,3,FALSE))=TRUE,\"$0\",VLOOKUP($A13,'Subgrantee F'!$B$105:$N$115,3,FALSE))","v":"$0"}]
["100-800 Instructional Other Items",null,{"$f":"IF(ISNA(VLOOKUP(A14,'Subgrantee A'!B$105:D$126,3,FALSE))=TRUE,\"$0\",VLOOKUP(A14,'Subgrantee A'!B$105:D$126,3,FALSE))","v":"$0"},{"$f":"IF(ISNA(VLOOKUP(A14,'Subgrantee B'!B$104:D$130,3,FALSE))=TRUE,\"$0\",VLOOKUP(A14,'Subgrantee B'!B$104:D$130,3,FALSE))","v":"$0"},{"$f":"IF(ISNA(VLOOKUP(A14,'Subgrantee C'!B$105:E$129,3,FALSE))=TRUE,\"$0\",VLOOKUP(A14,'Subgrantee C'!B$105:E$129,3,FALSE))","v":"$0"},{"$f":"IF(ISNA(VLOOKUP(A14,'Subgrantee D'!B$105:N$130,3,FALSE))=TRUE,\"$0\",VLOOKUP(A14,'Subgrantee D'!B$105:N$130,3,FALSE))","v":"$0"},{"$f":"IF(ISNA(VLOOKUP($A14,'Subgrantee E'!$B$105:$N$130,3,FALSE))=TRUE,\"$0\",VLOOKUP($A14,'Subgrantee E'!$B$105:$N$130,3,FALSE))","v":"$0"},{"$f":"IF(ISNA(VLOOKUP($A14,'Subgrantee F'!$B$105:$N$115,3,FALSE))=TRUE,\"$0\",VLOOKUP($A14,'Subgrantee F'!$B$105:$N$115,3,FALSE))","v":"$0"}]
["Subtotal - Instruction:",{"$f":"SUM(B10:B14)","v":0},{"$f":"SUM(C10:C14)","v":0},{"$f":"SUM(D10:D14)","v":0},0,0,0,0]
{"$rows_left_out":21}
{"sheet":"Subgrantee A","index":2,"n_rows":122,"n_cols":16,"rows_kept":122,"cut":false,"hidden":false,"merged":[[1,5,1,15],[0,0,0,15],[1,3,1,4],[2,0,2,15]]}
["This worksheet has one table spanning columns A through P with row 4 as the header row. There is a pivot table in cells B104 to D105. Columns M, N, and O have formulas. If the calculate budget button in C2 doesn't work, refresh the pivot table table in B104 to D105."]
["Sub-Grantee Name:",null,null,null,null,"Benefit Rates are based on current fiscal year OMB Circular for Employee Reimbursement Rates to view current rates click on https://www.nj.gov/infobank/circular/"]
[{"$f":"SUM(O5:O101)","v":0}]
["Project Goal/Obj/\nActivity #","Function/\nObject Code","Item Description or\nSALARY Position Name","Total Salary Amount \nor\nItem Cost","Enter \n% work time or\nItem Quantity","FICA ","PERS/\nTPAF ","Health Benefits","WC","UI","TDI","USL","Total %  Benefits","Program Charges to Grant","200-200 \nBenefits","Budget Justification"]
[null,null,null,null,null,null,null,null,null,null,null,null,{"$f":"SUM(F5:L5)","v":0},{"$f":"(D5*E5)","v":0},{"$f":"SUM(N5*M5)","v":0}]
[null,null,null,null,null,null,null,null,null,null,null,null,0,0,0]
[null,null,null,null,null,null,null,null,null,null,null,null,0,0,0]
[null,null,null,null,null,null,null,null,null,null,null,null,0,0,0]
[null,null,null,null,null,null,null,null,null,null,null,null,0,0,0]
[null,null,null,null,null,null,null,null,null,null,null,null,0,0,0]
[null,null,null,null,null,null,null,null,null,null,null,null,0,0,0]
[null,null,null,null,null,null,null,null,null,null,null,null,0,0,0]
[null,null,null,null,null,null,null,null,null,null,null,null,0,0,0]
[null,null,null,null,null,null,null,null,null,null,null,null,0,0,0]
[null,null,null,null,null,null,null,null,null,null,null,null,0,0,0]
{"$rows_left_out":108}
{"sheet":"Subgrantee B","index":3,"n_rows":122,"n_cols":16,"rows_kept":122,"cut":false,"hidden":false,"merged":[[1,5,1,15],[2,0,2,15],[1,3,1,4],[0,0,0,15]]}
["This worksheet has one table spanning columns A through P with row 4 as the header row. There is a pivot table in cells B103 to D104. Columns M, N, and O have formulas. If the calculate budget button in C2 doesn't work, refresh the pivot table table in B103 to D104."]
["Sub-Grantee Name:",null,null,null,null,"Benefit Rates are based on current fiscal year OMB Circular for EMPLOYEE BENEFIT REIMBURSEMENT RATES to view current rates click on https://www.nj.gov/infobank/circular/"]
[{"$f":"SUM(O5:O101)","v":0}]
["Project Goal/Obj/\nActivity #","Function/\nObject Code","Item Description or\nSALARY Position Name","Total Salary Amount \nor\nItem Cost","Enter \n% work time or\nItem Quantity","FICA ","PERS/\nTPAF ","Health Benefits","WC","UI","TDI","USL","Total %  Benefits","Program Charges to Grant","200-200 \nBenefits","Budget Justification"]
[null,null,null,null,null,null,null,null,null,null,null,null,{"$f":"SUM(F5:L5)","v":0},{"$f":"(D5*E5)","v":0},{"$f":"SUM(N5*M5)","v":0}]
[null,null,null,null,null,null,null,null,null,null,null,null,0,0,0]
[null,null,null,null,null,null,null,null,null,null,null,null,0,0,0]
[null,null,null,null,null,null,null,null,null,null,null,null,0,{"$f":"(D8*E8)","v":0},0]
[null,null,null,null,null,null,null,null,null,null,null,null,0,0,0]
[null,null,null,null,null,null,null,null,null,null,null,null,0,0,0]
[null,null,null,null,null,null,null,null,null,null,null,null,0,0,0]
[null,null,null,null,null,null,null,null,null,null,null,null,0,0,0]
[null,null,null,null,null,null,null,null,null,null,null,null,0,0,0]
[null,null,null,null,null,null,null,null,null,null,null,null,0,0,0]
[null,null,null,null,null,null,null,null,null,null,null,null,0,0,0]
{"$rows_left_out":108}
{"sheet":"Subgrantee C","index":4,"n_rows":122,"n_cols":16,"rows_kept":122,"cut":false,"hidden":false,"merged":[[1,5,1,15],[0,0,0,15],[1,3,1,4],[2,0,2,15]]}
["This worksheet has one table spanning columns A through P with row 4 as the header row. There is a pivot table in cells B104 to D106. Columns M, N, and O have formulas. If the calculate budget button in C2 doesn't work, refresh the pivot table table in B104 to D106."]
["Sub-Grantee Name:",null,null,null,null,"Benefit Rates are based on current fiscal year OMB Circular for EMPLOYEE BENEFIT REIMBURSEMENT RATES to view current rates click on https://www.nj.gov/infobank/circular/"]
[{"$f":"SUM(O5:O101)","v":0}]
["Project Goal/Obj/\nActivity #","Function/\nObject Code","Item Description or\nSALARY Position Name","Total Salary Amount \nor\nItem Cost","Enter \n% work time or\nItem Quantity","FICA ","PERS/\nTPAF ","Health Benefits","WC","UI","TDI","USL","Total %  Benefits","Program Charges to Grant","200-200 \nBenefits","Budget Justification"]
[null,null,null,null,null,null,null,null,null,null,null,null,{"$f":"SUM(F5:L5)","v":0},{"$f":"(D5*E5)","v":0},{"$f":"SUM(N5*M5)","v":0}]
[null,null,null,null,null,null,null,null,null,null,null,null,0,0,0]
[null,null,null,null,null,null,null,null,null,null,null,null,0,0,0]
[null,null,null,null,null,null,null,null,null,null,null,null,0,0,0]
[null,null,null,null,null,null,null,null,null,null,null,null,0,0,0]
[null,null,null,null,null,null,null,null,null,null,null,null,0,0,0]
[null,null,null,null,null,null,null,null,null,null,null,null,0,0,0]
[null,null,null,null,null,null,null,null,null,null,null,null,0,0,0]
[null,null,null,null,null,null,null,null,null,null,null,null,0,0,0]
[null,null,null,null,null,null,null,null,null,null,null,null,0,0,0]
[null,null,null,null,null,null,null,null,null,null,null,null,0,0,0]
{"$rows_left_out":108}
{"sheet":"Subgrantee D","index":5,"n_rows":122,"n_cols":16,"rows_kept":122,"cut":false,"hidden":false,"merged":[[1,5,1,15],[0,0,0,16383],[1,3,1,4],[2,0,2,15]]}
["This worksheet has one table spanning columns A through P with row 4 as the header row. There is a pivot table in cells B104 to D105. Columns M, N, and O have formulas. If the calculate budget button in C2 doesn't work, refresh the pivot table table in B104 to D105."]
["Sub-Grantee Name:",null,null,null,null,"Benefit Rates are based on current fiscal year OMB Circular for EMPLOYEE BENEFIT REIMBURSEMENT RATES to view current rates click on https://www.nj.gov/infobank/circular/"]
[{"$f":"SUM(O5:O101)","v":0}]
["Project Goal/Obj/\nActivity #","Function/\nObject Code","Item Description or\nSALARY Position Name","Total Salary Amount \nor\nItem Cost","Enter \n% work time or\nItem Quantity","FICA ","PERS/\nTPAF ","Health Benefits","WC","UI","TDI","USL","Total %  Benefits","Program Charges to Grant","200-200 \nBenefits","Budget Justification"]
[null,null,null,null,null,null,null,null,null,null,null,null,{"$f":"SUM(F5:L5)","v":0},{"$f":"(D5*E5)","v":0},{"$f":"SUM(N5*M5)","v":0}]
[null,null,null,null,null,null,null,null,null,null,null,null,0,0,0]
[null,null,null,null,null,null,null,null,null,null,null,null,0,0,0]
[null,null,null,null,null,null,null,null,null,null,null,null,0,0,0]
[null,null,null,null,null,null,null,null,null,null,null,null,0,0,0]
[null,null,null,null,null,null,null,null,null,null,null,null,0,0,0]
[null,null,null,null,null,null,null,null,null,null,null,null,0,0,0]
[null,null,null,null,null,null,null,null,null,null,null,null,0,0,0]
[null,null,null,null,null,null,null,null,null,null,null,null,0,0,0]
[null,null,null,null,null,null,null,null,null,null,null,null,0,0,0]
[null,null,null,null,null,null,null,null,null,null,null,null,0,0,0]
{"$rows_left_out":108}
{"sheet":"Subgrantee E","index":6,"n_rows":122,"n_cols":16,"rows_kept":122,"cut":false,"hidden":false,"merged":[[1,5,1,15],[0,0,0,15],[1,3,1,4],[2,0,2,15]]}
["This worksheet has one table spanning columns A through P with row 4 as the header row. There is a pivot table in cells B104 to D105. Columns M, N, and O have formulas. If the calculate budget button in C2 doesn't work, refresh the pivot table table in B104 to D105."]
["Sub-Grantee Name:",null,null,null,null,"Benefit Rates are based on current fiscal year OMB Circular for EMPLOYEE BENEFIT REIMBURSEMENT RATES to view current rates click on https://www.nj.gov/infobank/circular/"]
[{"$f":"SUM(O5:O101)","v":0}]
["Project Goal/Obj/\nActivity #","Function/\nObject Code","Item Description or\nSALARY Position Name","Total Salary Amount \nor\nItem Cost","Enter \n% work time or\nItem Quantity","FICA ","PERS/\nTPAF ","Health Benefits","WC","UI","TDI","USL","Total %  Benefits","Program Charges to Grant","200-200 \nBenefits","Budget Justification"]
[null,null,null,null,null,null,null,null,null,null,null,null,{"$f":"SUM(F5:L5)","v":0},{"$f":"(D5*E5)","v":0},{"$f":"SUM(N5*M5)","v":0}]
[null,null,null,null,null,null,null,null,null,null,null,null,0,0,0]
[null,null,null,null,null,null,null,null,null,null,null,null,0,0,0]
[null,null,null,null,null,null,null,null,null,null,null,null,0,0,0]
[null,null,null,null,null,null,null,null,null,null,null,null,0,0,0]
[null,null,null,null,null,null,null,null,null,null,null,null,0,0,0]
[null,null,null,null,null,null,null,null,null,null,null,null,0,0,0]
[null,null,null,null,null,null,null,null,null,null,null,null,0,0,0]
[null,null,null,null,null,null,null,null,null,null,null,null,0,0,0]
[null,null,null,null,null,null,null,null,null,null,null,null,0,0,0]
[null,null,null,null,null,null,null,null,null,null,null,null,0,0,0]
{"$rows_left_out":108}
{"sheet":"Subgrantee F","index":7,"n_rows":122,"n_cols":16,"rows_kept":122,"cut":false,"hidden":false,"merged":[[1,5,1,15],[0,0,0,15],[2,0,2,15],[1,3,1,4]]}
["This worksheet has one table spanning columns A through P with row 4 as the header row. There is a pivot table in cells B104 to D106. Columns M, N, and O have formulas. If the calculate budget button in C2 doesn't work, refresh the pivot table table in B104 to D106."]
["Sub-Grantee Name:",null,null,null,null,"Benefit Rates are based on current fiscal year OMB Circular for EMPLOYEE BENEFIT REIMBURSEMENT RATES to view current rates click on https://www.nj.gov/infobank/circular/"]
[{"$f":"SUM(O5:O101)","v":0}]
["Project Goal/Obj/\nActivity #","Function/\nObject Code","Item Description or\nSALARY Position Name","Total Salary Amount \nor\nItem Cost","Enter \n% work time or\nItem Quantity","FICA ","PERS/\nTPAF ","Health Benefits","WC","UI","TDI","USL","Total %  Benefits","Program Charges to Grant","200-200 \nBenefits","Budget Justification"]
[null,null,null,null,null,null,null,null,null,null,null,null,{"$f":"SUM(F5:L5)","v":0},{"$f":"(D5*E5)","v":0},{"$f":"SUM(N5*M5)","v":0}]
[null,null,null,null,null,null,null,null,null,null,null,null,0,0,0]
[null,null,null,null,null,null,null,null,null,null,null,null,0,0,0]
[null,null,null,null,null,null,null,null,null,null,null,null,0,0,0]
[null,null,null,null,null,null,null,null,null,null,null,null,0,0,0]
[null,null,null,null,null,null,null,null,null,null,null,null,0,0,0]
[null,null,null,null,null,null,null,null,null,null,null,null,0,0,0]
[null,null,null,null,null,null,null,null,null,null,null,null,0,0,0]
[null,null,null,null,null,null,null,null,null,null,null,null,0,0,0]
[null,null,null,null,null,null,null,null,null,null,null,null,0,0,0]
[null,null,null,null,null,null,null,null,null,null,null,null,0,0,0]
{"$rows_left_out":108}
{"sheet":"Data","index":8,"n_rows":15,"n_cols":1,"rows_kept":15,"cut":false,"hidden":false,"merged":[]}
["100-100 Instructional Salary"]
["100-300 Instructional Purchased Prof &Tech Services"]
["100-500 Instructional Purchased Services"]
["100-600 Instructional Supplies"]
["100-800 Instructional Other Items"]
["200-100 Non-Instructional Salary"]
["200-300 Non-Instructional Purchased Prof & Tech Services"]
["200-400 Non-Instructional Purchased Property Services"]
["200-500 Non-Instructional Purchased Services"]
["200-580 Non-Instructional Travel"]
["200-600 Non-Instructional Supplies"]
["200-800 Non-Instructional Other"]
["200-860 Indirect Costs"]
["400-731 Instructional Equipment"]
["400-732 Non-Instructional Equipment"]