{"text_format":"1","workbook":"xlsx","n_sheets":11,"sheets":["Programs","COVER","NARRATIVE","SUMMARY","ARTAB 1 2","ARTAB 3 4","ARTAB 5","ARTAB 6","ARTAB 7","Table A-D Reference Charts","Total Credits Earned Chart"],"not_rendered":{"charts":0,"images":0,"macros":0,"external_links":0,"defined_names":4,"comments":0,"pivot_tables":0},"unopened":[],"bounds":{"document_bytes":16777216,"sheet_cells":100000,"rows_first":2000,"rows_last":500,"rows_between":2000,"halvings":0,"cell_chars":16384,"cell_head_chars":4096},"cells_cut":0,"cells_raw":0,"read":"whole","date_system":"1900"}

{"sheet":"Programs","index":0,"n_rows":64,"n_cols":1,"rows_kept":64,"cut":false,"hidden":true,"merged":[]}
["Atlantic Cape Community College"]
["Bergen Community College"]
["Brookdale Community College"]
["Caldwell University"]
["Camden County College"]
["Centenary University"]
["County College of Morris"]
["Drew University"]
["Essex County College"]
["Fairleigh Dickinson University - Florham"]
["Fairleigh Dickinson University - Metropolitan"]
["Felician University"]
["Georgian Court University"]
["Hudson County Community College"]
["Kean University"]
["Mercer County Community College"]
["Middlesex County College"]
["Monmouth University"]
["Montclair State University"]
["Montclair State University - Bloomfield "]
{"$rows_left_out":45}
{"sheet":"COVER","index":1,"n_rows":24,"n_cols":12,"rows_kept":24,"cut":false,"hidden":false,"merged":[[23,1,23,2],[18,4,18,9],[21,4,21,9]]}
[null,null,"EDUCATIONAL OPPORTUNITY FUND"]
[null,null,"OFFICE OF THE SECRETARY OF HIGHER EDUCATION"]
[null,null,"PO BOX 542"]
[null,null,"TRENTON, NEW JERSEY  08625"]
[]
[]
[null,null,"Academic Year 2023-2024"]
[null,null,"ANNUAL REPORT"]
[null,null,null,null,null,null,null,null,null,null,null,"`"]
[]
[]
[]
[]
[]
[]
[null,"Institution/Program:",null,null,"Please select your institution/program from the drop-down menu."]
[]
[]
[null,"EOF Director:",null,null,"Please provide the EOF Director's name."]
[]
{"$rows_left_out":5}
{"sheet":"NARRATIVE","index":2,"n_rows":7,"n_cols":2,"rows_kept":7,"cut":false,"hidden":false,"merged":[[0,1,0,10],[2,1,4,10],[6,1,29,11]]}
[null,"ANNUAL REPORT NARRATIVE"]
[]
[null,"When writing your program's annual report narrative, clearly divide and label each section in a manner that will allow for the reader to make a clear and obvious distinction in your responses to each of the items listed below. "]
[]
[]
[]
[null,"1) Please list the major accomplishments of your program as well as student accomplishments during the 2023-2024 academic year.  \n\nThe narrative must include an assessment of how you met the EOF program goals and objectives contained in your FY 2024 (FY24) EOF Contract Attachment B1 (please refer back to your B1 contract attachment for FY24).  \n\n2) Describe how you have used the results from FY24 to change any program services offered for FY25.\n \n3) Describe/outline any components of your program's activities or characteristics of the student population that you serve that cannot be captured in Tables 1-7 of the EOF Annual Report or the program goals and objectives listed in the contract budget attachments  B1 for the 2023-2024 academic year.\n\nIn addition to providing outcomes data not covered in the formal report pages, you can also include information about program changes and collaborations that have helped to improve services to students and have increased efficiencies and/or strengthened program components.\n\n4) As a result of your FY 2024 EOF academic year Article IV budget allocation and institutional financial support, describe program enhancements and/or challenges you confronted and how they were addressed as a result of the budget. \n\n\n\nPLEASE NOTE:  THIS NARRATIVE MUST BE PROVIDED IN A SEPARATE WORD DOCUMENT.\n"]

{"sheet":"SUMMARY","index":3,"n_rows":76,"n_cols":8,"rows_kept":76,"cut":false,"hidden":false,"merged":[[74,0,74,5],[42,7,44,7],[75,1,75,2],[47,1,50,7],[53,1,53,7],[54,1,57,7],[60,1,65,7],[72,1,72,2],[20,16,20,17],[71,0,71,5],[0,0,0,7],[4,0,9,7],[2,0,2,7],[24,1,26,7],[67,7,69,7],[12,0,12,5],[19,6,20,7],[23,0,23,5],[35,0,35,5],[52,1,52,5],[59,1,59,5]]}
["Academic Year 2023-2024"]
[]
["ANNUAL REPORT SUMMARY"]
[]
["The EOF Annual Report is used to collect data on the students who received a EOF grant or who were non-funded during 2023-2024 Academic Year (AY).  We understand that depending on how your program is structured and supported by your institution, your program may have provided services to non-EOF students (i.e. EOF funds were not used to support these students and the institution covered all expenses associated with supporting your non-EOF students). However, for the purposes of this report, programs are ONLY permitted to report on EOF FUNDED (i.e. Paid students) and EOF NON-FUNDED students who attended your program during the 2023-2024 academic year and who appear on the EOF NJFAMS Final Enrollment Report.\n\nTotals provided on this spreadsheet should remain consistent and will be referenced throughout the report."]
[]
[]
[]
[]
[]
[]
[]
["1) Number of students (unduplicated headcount*) on the AY 23-24 Final Enrollment Report:"]
[]
[null,"To determine the unduplicated headcount:"]
[null,"     # FUNDED only students (do not include mixed funded):"]
[null,"     # NON-FUNDED only students:"]
[null,"     # students with MIXED FUNDING status:"]
[null,"          (mixed = 1 semester funded, 1 semester non-funded)"]
[null,"Unduplicated headcount = total funded/non-funded/mixed",null,null,null,{"$f":"IF(SUM(F16:F19)=0,\"\",SUM(F16:F19))","v":""},"Total must equal unduplicated count in #1."]
{"$rows_left_out":57}
{"sheet":"ARTAB 1 2","index":4,"n_rows":61,"n_cols":8,"rows_kept":61,"cut":false,"hidden":false,"merged":[[49,0,49,2],[49,4,49,7],[2,0,3,6],[9,0,10,6],[8,0,8,6],[7,0,7,6],[6,0,6,6]]}
["TABLE 1","SEPARATION REPORT: ATTRITION"]
[]
["The number of students reported as separated in this table should equal the number of students reported as separated within the summary section (Question #4) on page 1 ="]
[null,null,null,null,null,null,null,{"$f":"IF(SUMMARY!G72=\"\",\"\",SUMMARY!G72)","v":""}]
["NOTE: Students who graduated are not included in this table.  They are reported in Table 2."]
[]
["1.  How many students enrolled in your program in spring 2023 but did not return in fall 2023?"]
["2.  How many students who enrolled and completed fall 2023 but did not return for spring 2024? "]
["3.  How many students dropped out before completing the fall 2023 semester?"]
["4.  How many students dropped out before completing the spring 2024 semester?\n*dropped out = withdrew; transfer; ANY reason for separation"]
[]
[null,null,null,null,null,"TOTAL # SEPARATED:",null,{"$f":"SUM(H7:H10)","v":0}]
[]
["Please indicate the primary reason for separation (list 1 per student):"]
[]
["a.","Transferred to other institution"]
["b.","Academic dismissal"]
["c.","Could not make adjustment to college"]
["d.","Needed to seek full-time employment"]
["e.","Unable to meet cost of attendance"]
{"$rows_left_out":42}
{"sheet":"ARTAB 3 4","index":5,"n_rows":56,"n_cols":7,"rows_kept":56,"cut":false,"hidden":false,"merged":[[22,6,23,7],[30,2,30,3],[29,6,29,7],[28,6,28,7],[27,6,27,7],[22,2,22,3],[22,4,22,5],[23,2,23,3],[23,4,23,5],[29,2,29,3],[28,2,28,3],[27,2,27,3],[26,2,26,3],[18,0,18,7],[19,0,19,7],[20,0,20,7],[2,0,6,7],[7,0,7,7],[8,0,9,7],[11,0,11,7],[13,0,13,7],[14,0,14,7],[15,0,15,7],[17,0,17,7],[16,0,16,7],[46,0,47,7],[24,2,24,3],[25,2,25,3],[30,6,30,7],[30,4,30,5],[26,4,26,5],[25,4,25,5],[24,4,24,5],[26,6,26,7],[25,6,25,7],[24,6,24,7],[29,4,29,5],[28,4,28,5],[27,4,27,5],[41,0,42,4]]}
["TABLE 3","COUNSELING, ADVISEMENT, AND STUDENT DEVELOPMENT SERVICES"]
[]
["Indicate the number of counseling CONTACTS* provided to EOF funded and non-funded students** by EOF staff (e.g. directors, counselors, administrative assistants, etc.) as well as those individuals listed in your AY Article IV contract as providing a percentage of their time in support to the EOF program (e.g. financial aid officer with percentage of time to EOF).  If more than one counseling topic was covered in the session, select the primary purpose for the session. Programs are expected to maintain documentation of all contacts."]
[]
[]
[]
[]
["     *Contacts = number of MEETINGS with students, not the number of students"]
["     **Non-funded student = a renewal student who lost eligibility for a grant but continues to receive program support services or financially ineligible GEAR UP/COLLEGE BOUND/TRIO student who was admitted into the program."]
[]
[]
["For purposes of this report, services are defined as follows:"]
[]
["INDIVIDUAL CONTACTS = one-on-one meeting by phone, internet, in person, scheduled or drop-in"]
["GROUP CONTACTS = more than one person, in formal group meeting, by internet or in person, scheduled or drop-in"]
["     Personal = family/relationship issues, self-esteem problems, peer pressure, etc."]
["     Academic = course assignments, schedules, time management, selecting major, grades, etc."]
["     Financial = college budget, personal finance issues, problems with financial aid package, etc."]
["     Career = resume, job search, references, internship opportunities, etc."]
["     Administrative =  forms, signatures, paperwork, etc."]
{"$rows_left_out":37}
{"sheet":"ARTAB 5","index":6,"n_rows":51,"n_cols":5,"rows_kept":51,"cut":false,"hidden":false,"merged":[[32,0,32,4],[37,0,37,4],[42,0,42,1],[43,0,43,1],[44,0,44,1],[26,0,26,1],[25,0,25,1],[4,0,5,5],[2,0,3,5],[14,0,14,4],[19,0,19,4],[24,0,24,1]]}
["TABLE 5","BASIC SKILLS REMEDIATION"]
[]
["To determine the characteristics of your students, please distribute the number of students who were identified at the start of the semester as needing basic skills remediation in math, writing, and reading."]
[]
["For the purpose of this report, basic skills courses are any courses in these subject areas that are below a 100 level course (001-099)."]
[]
[]
["Examples:","MATH = ","elementary math, pre-algebra, algebra"]
[null,"WRITING =","communication skills (written and oral)"]
[null,"READING =","comprehension skills development"]
[]
["1. How many students were identified as needing remediation at the beginning of the "]
["FALL SEMESTER:"]
[]
["One Area of Remediation"]
["MATH only","WRITING only","READING only","READING/WRITING*","TOTAL"]
[null,null,null,null,{"$f":"SUM(A17:D17)","v":0}]
["* Reading/writing combined course"]
[]
["Two Areas of Remediation"]
{"$rows_left_out":32}
{"sheet":"ARTAB 6","index":7,"n_rows":53,"n_cols":9,"rows_kept":53,"cut":false,"hidden":false,"merged":[[45,0,50,6],[7,5,9,8],[7,3,9,4],[7,0,9,2],[43,0,43,6]]}
["TABLE 6","FINANCIAL AID DISTRIBUTION"]
[]
["(Non-EOF ) = Regular Admit Students: distribute the financial aid provided from the sources listed below."]
["EOF Students: distribute the financial aid provided for SUMMER and ACADEMIC YEAR from the sources listed."]
["# = total number of students receiving aid from each source."]
["Amount = total dollar amount of aid provided from each source. (This is not a per student number.)"]
[]
["FY 2024 ",null,null,"NON-EOF\nSTUDENTS",null,"    EOF PROGRAM\nSTUDENTS"]
[]
[]
[null,null,null,"        AY 2023-2024",null,"     SUMMER 2023",null,"         AY 2023-2024"]
["A. INSTITUTIONAL FUNDS",null,null,"#","Amount","#","Amount","# *","Amount"]
["Institutional Grant"]
["Waivers (Tuition & Fees)"]
["Loans"]
["Work"]
["Sub-total",null,null,{"$f":"SUM(D13:D16)","v":0},0,0,0,0,0]
["B. FEDERAL FUNDS",null,null,"#","Amount","#","Amount","#","Amount"]
["PELL"]
["SEOG"]
{"$rows_left_out":34}
{"sheet":"ARTAB 7","index":8,"n_rows":139,"n_cols":14,"rows_kept":139,"cut":false,"hidden":false,"merged":[[1,0,1,13],[2,0,2,13],[3,0,3,13],[109,1,109,12],[54,1,54,12],[23,0,23,13],[24,0,24,13],[25,0,25,13],[44,5,44,6],[45,5,45,6],[44,8,44,9],[45,8,45,9],[44,11,44,12],[45,11,45,12],[47,12,47,13],[73,11,73,12],[81,0,81,13],[104,0,104,13],[76,0,76,13],[53,0,53,13],[75,12,75,13],[51,0,51,13],[52,0,52,13],[73,8,73,9],[72,8,72,9],[73,5,73,6],[72,5,72,6],[72,11,72,12],[138,11,139,11],[136,0,136,10],[4,0,20,13],[21,0,21,11],[27,0,28,0],[26,1,26,12],[55,0,56,0],[83,0,84,0],[82,1,82,12],[48,0,48,13],[134,0,134,10],[101,5,101,6],[100,5,100,6],[127,5,127,6],[128,8,128,9],[138,0,139,10],[131,0,131,13],[130,12,130,13],[103,12,103,13],[80,0,80,13],[79,0,79,13],[106,0,106,13],[108,0,108,13],[101,11,101,12],[100,11,100,12],[101,8,101,9],[100,8,100,9],[127,8,127,9],[128,5,128,6],[127,11,127,12],[128,11,128,12],[110,0,111,0]]}
["TABLE 7","STUDENT PROGRESS INDICATORS"]
["#1 Distribute your AY 23-24 students by award counter, gpa, and total cumulative credits earned at your institution."]
["#2 Report the total number of degree and non-degree credits attempted vs. earned for all students listed. "]
["#3  Indicate the number of students NOT making satisfactory progress. "]
["Please note for each table that follows:\nA) The total number of credits earned (Section #2) should equal the distribution of credits in Section #1 above. \nThis information should reflect each student's cumulative academic progress to-date (not just the credits earned during AY 2023-2024).\nB) Transfers listed in column M should be distributed throughout columns (A) thru (K) and INCLUDED in column L (total). For the purposes of Table 7, please only include external transfer students in column (M). These students should also be reflected in the Annual Report Summary section 3c-3. Non-EOF Internal transfer students and EOF Internal transfer students (as reported in the Annual Report Summary section 3c-1 & 3c-2) should be distributed throughout columns (A) thru (K) and included in column L (total).\nC) Degree credits attempted in Section # 2 should include withdrawals and incompletes.\nD) Students with a cumulative award counter of .25 (part-time freshman) should be rounded up and included in Table 7A (award counter = .50).  Students with a cumulative award counter of .75 should be rounded up and included in Table 7B (award counter = 1.00). Students with a cumulative award counter of 1.25 should be rounded up and included in Table 7c (award counter = 1.5 and up).\nE) Non-funded ONLY students reported in Table 7D MUST be listed on the Final Enrollment Report. The number of students should match the information contained in item #1 within the Summary section.\nF) When completing tables 7A-7D, the total number of credits earned within each column (A-K) should not fall below the minimum and maximum allowable range. (Example: If there are only 4 students listed within column B (13-24 credits), then the minimum number of credits earned for this column (13 credits x 4 students) = 52 credits. The maximum number of credits would be (24 credits x 4 students) = 96 credits.)\nG) To assist programs with the ability to confirm the appropriateness of the information provided in Tables 7A-7D, programs can refer to the \"Table A-D Reference Charts\" and \"Total Credits Earned Chart\" tabs.\n\n"]
[]
[]
[]
[]
[]
[]
[]
[]
[]
[]
[]
[]
[]
[]
[]
{"$rows_left_out":120}
{"sheet":"Table A-D Reference Charts","index":9,"n_rows":26,"n_cols":25,"rows_kept":26,"cut":false,"hidden":false,"merged":[[11,1,11,24],[16,1,16,24],[3,23,3,24],[8,23,8,24],[13,23,13,24],[13,1,13,2],[3,9,3,10],[8,13,8,14],[8,15,8,16],[3,7,3,8],[7,1,7,24],[3,17,3,18],[3,19,3,20],[3,21,3,22],[8,1,8,2],[8,17,8,18],[23,19,23,20],[23,21,23,22],[18,15,18,16],[18,19,18,20],[18,21,18,22],[21,1,21,24],[18,13,18,14],[23,23,23,24],[18,23,18,24],[23,1,23,2],[23,3,23,4],[23,5,23,6],[23,7,23,8],[23,9,23,10],[22,1,22,24],[23,11,23,12],[23,13,23,14],[23,15,23,16],[23,17,23,18],[13,3,13,4],[13,5,13,6],[13,7,13,8],[13,9,13,10],[18,17,18,18],[13,13,13,14],[13,15,13,16],[13,17,13,18],[18,1,18,2],[17,1,17,24],[12,1,12,24],[8,9,8,10],[13,21,13,22],[8,21,8,22],[18,3,18,4],[18,5,18,6],[18,7,18,8],[18,9,18,10],[18,11,18,12],[13,19,13,20],[13,11,13,12],[8,19,8,20],[8,3,8,4],[8,5,8,6],[8,7,8,8],[0,1,0,24],[3,13,3,14],[3,15,3,16],[1,1,1,24],[8,11,8,12],[3,1,3,2],[3,11,3,12],[3,3,3,4],[3,5,3,6],[2,1,2,24],[6,1,6,24]]}
[null,"The information below is provided as a reference tool ONLY. The data reflected within Tables 7A-7D must fall within the identified ranges indicated below."]
[null,"Total Cumulative # of Credits Earned Minimum and Maximum Chart"]
[null,"Credits Ranges"]
[null,"0-12",null,"13-24",null,"25-36",null,"37-48",null,"49-60",null,"61-72",null,"73-84",null,"85-96",null,"97-108",null,"109-120",null,"121+",null,"Total Credits Earned"]
[null,"Min ","Max","Min ","Max","Min ","Max","Min ","Max","Min ","Max","Min ","Max","Min ","Max","Min ","Max","Min ","Max","Min ","Max","Min ","Max","Min","Max"]
[null,0,12,13,24,25,36,37,48,49,60,61,72,73,84,85,96,97,108,109,120,121,200,{"$f":"SUM(B6,D6,F6,H6,J6,L6,N6,P6,R6,T6,V6)","v":670},{"$f":"SUM(C6,E6,G6,I6,K6,M6,O6,Q6,S6,U6,W6)","v":860}]
[]
[null,"Table 7A Reference Chart"]
[null,"0-12",null,"13-24",null,"25-36",null,"37-48",null,"49-60",null,"61-72",null,"73-84",null,"85-96",null,"97-108",null,"109-120",null,"121+",null,"Total Credits Earned"]
[null,"Min ","Max","Min ","Max","Min ","Max","Min ","Max","Min ","Max","Min ","Max","Min ","Max","Min ","Max","Min ","Max","Min ","Max","Min ","Max","Min","Max"]
[null,{"$f":"'ARTAB 7'!B42*'Table A-D Reference Charts'!B6","v":0},{"$f":"'ARTAB 7'!B42*C6","v":0},{"$f":"'ARTAB 7'!C42*'Table A-D Reference Charts'!D6","v":0},{"$f":"'ARTAB 7'!C42*E6","v":0},{"$f":"'ARTAB 7'!D42*F6","v":0},{"$f":"'ARTAB 7'!D42*G6","v":0},{"$f":"'ARTAB 7'!E42*H6","v":0},{"$f":"'ARTAB 7'!E42*I6","v":0},{"$f":"'ARTAB 7'!F42*J6","v":0},{"$f":"'ARTAB 7'!F42*K6","v":0},{"$f":"'ARTAB 7'!G42*L6","v":0},{"$f":"'ARTAB 7'!G42*M6","v":0},{"$f":"'ARTAB 7'!H42*N6","v":0},{"$f":"'ARTAB 7'!H42*O6","v":0},{"$f":"'ARTAB 7'!I42*P6","v":0},{"$f":"'ARTAB 7'!I42*Q6","v":0},{"$f":"'ARTAB 7'!J42*R6","v":0},{"$f":"'ARTAB 7'!J42*S6","v":0},{"$f":"'ARTAB 7'!K42*T6","v":0},{"$f":"'ARTAB 7'!K42*U6","v":0},{"$f":"'ARTAB 7'!L42*V6","v":0},{"$f":"'ARTAB 7'!L42*W6","v":0},{"$f":"SUM(B11,D11,F11,H11,J11,L11,N11,P11,R11,T11,V11)","v":0},{"$f":"SUM(C11,E11,G11,I11,K11,M11,O11,Q11,S11,U11,W11)","v":0}]
[]
[null,"Table 7B Reference Chart"]
[null,"0-12",null,"13-24",null,"25-36",null,"37-48",null,"49-60",null,"61-72",null,"73-84",null,"85-96",null,"97-108",null,"109-120",null,"121+",null,"Total Credits Earned"]
[null,"Min ","Max","Min ","Max","Min ","Max","Min ","Max","Min ","Max","Min ","Max","Min ","Max","Min ","Max","Min ","Max","Min ","Max","Min ","Max","Min","Max"]
[null,{"$f":"'ARTAB 7'!B70*'Table A-D Reference Charts'!B6","v":0},{"$f":"'ARTAB 7'!B70*'Table A-D Reference Charts'!C6","v":0},{"$f":"'ARTAB 7'!C70*'Table A-D Reference Charts'!D6","v":0},{"$f":"'ARTAB 7'!C70*'Table A-D Reference Charts'!E6","v":0},{"$f":"'ARTAB 7'!D70*'Table A-D Reference Charts'!F6","v":0},{"$f":"'ARTAB 7'!D70*'Table A-D Reference Charts'!G6","v":0},{"$f":"'ARTAB 7'!E70*'Table A-D Reference Charts'!H6","v":0},{"$f":"'ARTAB 7'!E70*'Table A-D Reference Charts'!I6","v":0},{"$f":"'ARTAB 7'!F70*'Table A-D Reference Charts'!J6","v":0},{"$f":"'ARTAB 7'!F70*'Table A-D Reference Charts'!K6","v":0},{"$f":"'ARTAB 7'!G70*'Table A-D Reference Charts'!L6","v":0},{"$f":"'ARTAB 7'!G70*'Table A-D Reference Charts'!M6","v":0},{"$f":"'ARTAB 7'!H70*'Table A-D Reference Charts'!N6","v":0},{"$f":"'ARTAB 7'!H70*'Table A-D Reference Charts'!O6","v":0},{"$f":"'ARTAB 7'!I70*P6","v":0},{"$f":"'ARTAB 7'!I70*Q6","v":0},{"$f":"'ARTAB 7'!J70*R6","v":0},{"$f":"'ARTAB 7'!J70*S6","v":0},{"$f":"'ARTAB 7'!K70*T6","v":0},{"$f":"'ARTAB 7'!K70*U6","v":0},{"$f":"'ARTAB 7'!L70*V6","v":0},{"$f":"'ARTAB 7'!L70*W6","v":0},{"$f":"SUM(B16,D16,F16,H16,J16,L16,N16,P16,R16,T16,V16)","v":0},{"$f":"SUM(C16,E16,G16,I16,K16,M16,O16,Q16,S16,U16,W16)","v":0}]
[]
[null,"Table 7C Reference Chart"]
[null,"0-12",null,"13-24",null,"25-36",null,"37-48",null,"49-60",null,"61-72",null,"73-84",null,"85-96",null,"97-108",null,"109-120",null,"121+",null,"Total Credits Earned"]
[null,"Min ","Max","Min ","Max","Min ","Max","Min ","Max","Min ","Max","Min ","Max","Min ","Max","Min ","Max","Min ","Max","Min ","Max","Min ","Max","Min","Max"]
{"$rows_left_out":7}
{"sheet":"Total Credits Earned Chart","index":10,"n_rows":505,"n_cols":24,"rows_kept":505,"cut":false,"hidden":false,"merged":[[0,1,0,23],[2,1,4,1],[1,2,1,23],[2,2,2,23],[3,10,3,11],[3,8,3,9],[3,6,3,7],[3,4,3,5],[3,2,3,3],[3,22,3,23],[3,20,3,21],[3,18,3,19],[3,16,3,17],[3,14,3,15],[3,12,3,13]]}
[null,"The information below is provided as a reference tool ONLY. The data reflected within Tables 7A-7D must fall within the identified ranges indicated below."]
[null,null,"Total Cumulative # of Credits Earned Minimum and Maximum Chart"]
[null,"# of Students","Credit Ranges"]
[null,null,"0-12",null,"13-24",null,"25-36",null,"37-48",null,"49-60",null,"61-72",null,"73-84",null,"85-96",null,"97-108",null,"109-120",null,"121+"]
[null,null,"Min ","Max","Min ","Max","Min ","Max","Min ","Max","Min ","Max","Min ","Max","Min ","Max","Min ","Max","Min ","Max","Min ","Max","Min ","Max"]
[null,1,0,12,13,24,24,36,37,48,49,60,61,72,73,84,85,96,97,108,109,120,121,200]
[null,2,{"$f":"C$6*$B7","v":0},{"$f":"D$6*$B7","v":24},26,48,48,72,74,{"$f":"J$6*$B7","v":96},98,120,122,144,146,168,170,192,194,216,218,240,242,400]
[null,3,0,{"$f":"D$6*$B8","v":36},39,72,72,108,111,{"$f":"J$6*$B8","v":144},{"$f":"K$6*$B8","v":147},180,183,216,219,252,255,288,291,324,327,360,363,600]
[null,4,0,48,52,96,96,144,148,192,196,240,244,288,292,336,340,384,388,432,436,480,484,800]
[null,5,0,60,65,120,120,180,185,240,245,300,305,360,365,420,425,480,485,540,545,600,605,1000]
[null,6,0,72,78,144,144,216,222,288,294,360,366,432,438,504,510,576,582,648,654,720,726,1200]
[null,7,0,84,91,168,168,252,259,336,343,420,427,504,511,588,595,672,679,756,763,840,847,1400]
[null,8,0,96,104,192,192,288,296,384,392,480,488,576,584,672,680,768,776,864,872,960,968,1600]
[null,9,0,108,117,216,216,324,333,432,441,540,549,648,657,756,765,864,873,972,981,1080,1089,1800]
[null,10,0,120,130,240,240,360,370,480,490,600,610,720,730,840,850,960,970,1080,1090,1200,1210,2000]
[null,11,0,132,143,264,264,396,407,528,539,660,671,792,803,924,935,1056,1067,1188,1199,1320,1331,2200]
[null,12,0,144,156,288,288,432,444,576,588,720,732,864,876,1008,1020,1152,1164,1296,1308,1440,1452,2400]
[null,13,0,156,169,312,312,468,481,624,637,780,793,936,949,1092,1105,1248,1261,1404,1417,1560,1573,2600]
[null,14,0,168,182,336,336,504,518,672,686,840,854,1008,1022,1176,1190,1344,1358,1512,1526,{"$f":"V$6*$B19","v":1680},1694,2800]
[null,15,0,180,195,360,360,540,555,720,735,900,915,1080,1095,1260,1275,1440,1455,1620,1635,1800,1815,3000]
{"$rows_left_out":485}